{"text_format":"2","workbook":"xlsx","n_sheets":5,"sheets":["Instructions","1. Determine Area HCC","2. Input Unit Mix","3. Costs and Eligibility","2022 TDC&HCC"],"not_rendered":{"charts":0,"images":0,"macros":0,"external_links":0,"defined_names":3,"comments":0,"pivot_tables":1},"unopened":[],"bounds":{"document_bytes":16777216,"sheet_cells":100000,"run_cost":"one","rows_first":2000,"rows_last":500,"rows_between":2000,"halvings":0,"cell_chars":16384,"cell_head_chars":4096},"cells_cut":0,"cells_raw":0,"read":"whole","date_system":"1900"}

{"sheet":"Instructions","index":0,"n_rows":9,"n_cols":5,"rows_kept":9,"cut":false,"hidden":false,"merged":[[4,4,4,7],[6,4,6,7],[29,2,29,7],[30,2,30,7],[31,2,31,7],[26,2,26,7],[27,2,27,7]]}
[]
[]
[null,null,"Worksheet to Determine RAD Section 202 PRAC Preservation Rent Increase Eligibility"]
[]
[null,null,"Property Name:",null,"Sample Property Name"]
[]
[null,null,"Property Address:",null,"Sample Property Address"]
[]
[null,null,"Total Units:",null,0]

{"sheet":"1. Determine Area HCC","index":1,"n_rows":87,"n_cols":10,"rows_kept":87,"cut":false,"hidden":false,"merged":[[34,6,38,8],[40,6,44,8],[28,6,32,8],[24,6,26,8]]}
[]
[]
[null,null,"Determining Housing Construction Costs in your Area"]
[]
[null,null,{"$f":"IF(Instructions!E5=\"\",\"Enter Property Name on Instructions Tab\",CONCATENATE(\"Property Name: \",Instructions!E5))","v":"Property Name: Sample Property Name"}]
[]
[null,null,{"$f":"IF(Instructions!E7=\"\",\"Enter Property Address on Instructions Tab\",CONCATENATE(\"Property Address: \",Instructions!E7))","v":"Property Address: Sample Property Address"}]
[]
[null,null,{"$f":"IF(Instructions!E9=\"\",\"Enter Unit Count on Instructions Tab\",CONCATENATE(\"Total Units: \",Instructions!E9))","v":"Total Units: 0"}]
{"$rows_empty":14}
[null,null,"Select the City/MSA and State for your project."]
[]
[null,null,"Select City --> ","(All)"]
[null,null,"Select State -->","(All)"]
[]
[null,null,"Type","Data","Total"]
[null,null,"Detached/Semi-Detached","Sum of 0 Bedrooms, TDC",80380115.389999971]
[null,null,null,"Sum of 1 Bedrooms, TDC",104224279.25999989]
[null,null,null,"Sum of 2 Bedrooms, TDC",124514090.70000018]
[null,null,null,"Sum of 3 Bedrooms, TDC",148352524.74000004]
[null,null,null,"Sum of 4 Bedrooms, TDC",174569108.73000002]
[null,null,null,"Sum of 5 Bedrooms, TDC",191391382.92999986]
[null,null,null,"Sum of 6 Bedrooms, TDC",207640631.23999983]
[null,null,null,"Sum of 0 Bedrooms, HCC",45931494.539999984]
[null,null,null,"Sum of 1 Bedrooms, HCC",59556731.069999985]
[null,null,null,"Sum of 2 Bedrooms, HCC",71150909.039999947]
[null,null,null,"Sum of 3 Bedrooms, HCC",84772871.320000023]
[null,null,null,"Sum of 4 Bedrooms, HCC",99753776.360000044]
[null,null,null,"Sum of 5 Bedrooms, HCC",109366504.40000001]
[null,null,null,"Sum of 6 Bedrooms, HCC",118651789.25000018]
[null,null,"Elevator","Sum of 0 Bedrooms, TDC",59330930.400000021]
[null,null,null,"Sum of 1 Bedrooms, TDC",83063302.680000186]
[null,null,null,"Sum of 2 Bedrooms, TDC",106795674.85000001]
[null,null,null,"Sum of 3 Bedrooms, TDC",142394232.83999985]
[null,null,null,"Sum of 4 Bedrooms, TDC",177992791.32000014]
[null,null,null,"Sum of 5 Bedrooms, TDC",201725163.49999991]
[null,null,null,"Sum of 6 Bedrooms, TDC",225457535.77999982]
[null,null,null,"Sum of 0 Bedrooms, HCC",37081830.949999996]
[null,null,null,"Sum of 1 Bedrooms, HCC",51914563.300000019]
[null,null,null,"Sum of 2 Bedrooms, HCC",66747295.79999993]
{"$rows_left_out":35}
{"sheet":"2. Input Unit Mix","index":2,"n_rows":67,"n_cols":9,"rows_kept":67,"cut":false,"hidden":false,"merged":[[22,4,22,6],[22,8,23,8]]}
[]
[]
[null,null,"Input Unit Mix and Building Type"]
[]
[null,null,{"$f":"IF(Instructions!$E$5=\"\",\"Enter Property Name on Instructions Tab\",CONCATENATE(\"Property Name: \",Instructions!$E$5))","v":"Property Name: Sample Property Name"}]
[]
[null,null,{"$f":"IF(Instructions!$E$7=\"\",\"Enter Property Address on Instructions Tab\",CONCATENATE(\"Property Address: \",Instructions!$E$7))","v":"Property Address: Sample Property Address"}]
[]
[null,null,{"$f":"IF(Instructions!$E$9=\"\",\"Enter Unit Count on Instructions Tab\",CONCATENATE(\"Total Units: \",Instructions!$E$9))","v":"Total Units: 0"}]
{"$rows_empty":11}
[null,null,"A. Housing Construction Costs By Bedroom Type "]
[]
[null,null,"Metro Area Selected:",null,{"$f":"CONCATENATE('1. Determine Area HCC'!D26,\", \",'1. Determine Area HCC'!D27)","v":"(All), (All)"},null,null,null,{"$f":"IF(G67<>Instructions!E9,\"Reconcile Unit Count Discrepancy Between Instructions Tab and Unit Mix\",\"\")","v":""}]
[]
[]
[{"$nulls":4},"COST PER UNIT",null,"NUMBER OF UNITS",null,"TOTAL BY TYPE"]
[null,null,"DETACHED OR SEMI-DETACHED"]
[null,null,"ZERO BEDROOM",null,{"$f":"GETPIVOTDATA(\"Sum of 0 Bedrooms, HCC\",'1. Determine Area HCC'!$C$29,\"Type\",\"Detached/Semi-Detached\")","v":45931494.539999984},null,0,null,{"$f":"SUM(E28*G28)","v":0}]
[null,null,"ONE BEDROOM",null,{"$f":"GETPIVOTDATA(\"Sum of 1 Bedrooms, HCC\",'1. Determine Area HCC'!$C$29,\"Type\",\"Detached/Semi-Detached\")","v":59556731.069999985},null,0,null,{"$f":"SUM(E29*G29)","v":0}]
[null,null,"TWO BEDROOM",null,{"$f":"GETPIVOTDATA(\"Sum of 2 Bedrooms, HCC\",'1. Determine Area HCC'!$C$29,\"Type\",\"Detached/Semi-Detached\")","v":71150909.039999947},null,0,null,{"$f":"SUM(E30*G30)","v":0}]
[null,null,"THREE BEDROOM",null,{"$f":"GETPIVOTDATA(\"Sum of 3 Bedrooms, HCC\",'1. Determine Area HCC'!$C$29,\"Type\",\"Detached/Semi-Detached\")","v":84772871.320000023},null,0,null,0]
[null,null,"FOUR BEDROOM",null,{"$f":"GETPIVOTDATA(\"Sum of 4 Bedrooms, HCC\",'1. Determine Area HCC'!$C$29,\"Type\",\"Detached/Semi-Detached\")","v":99753776.360000044},null,0,null,0]
[null,null,"FIVE BEDROOM",null,{"$f":"GETPIVOTDATA(\"Sum of 5 Bedrooms, HCC\",'1. Determine Area HCC'!$C$29,\"Type\",\"Detached/Semi-Detached\")","v":109366504.40000001},null,0,null,0]
[null,null,"SIX BEDROOM",null,{"$f":"GETPIVOTDATA(\"Sum of 6 Bedrooms, HCC\",'1. Determine Area HCC'!$C$29,\"Type\",\"Detached/Semi-Detached\")","v":118651789.25000018},null,0,null,0]
[null,null,"SUBTOTAL COST BY TYPE",null,null,null,{"$f":"SUM(G28:G34)","v":0},null,{"$f":"SUM(I27:I34)","v":0}]
[]
[null,null,"ELEVATOR"]
[null,null,"ZERO BEDROOM",null,{"$f":"GETPIVOTDATA(\"Sum of 0 Bedrooms, HCC\",'1. Determine Area HCC'!$C$29,\"Type\",\"Elevator\")","v":37081830.949999996},null,0,null,{"$f":"SUM(E38*G38)","v":0}]
[null,null,"ONE BEDROOM",null,{"$f":"GETPIVOTDATA(\"Sum of 1 Bedrooms, HCC\",'1. Determine Area HCC'!$C$29,\"Type\",\"Elevator\")","v":51914563.300000019},null,0,null,0]
[null,null,"TWO BEDROOM",null,{"$f":"GETPIVOTDATA(\"Sum of 2 Bedrooms, HCC\",'1. Determine Area HCC'!$C$29,\"Type\",\"Elevator\")","v":66747295.79999993},null,0,null,0]
[null,null,"THREE BEDROOM",null,{"$f":"GETPIVOTDATA(\"Sum of 3 Bedrooms, HCC\",'1. Determine Area HCC'!$C$29,\"Type\",\"Elevator\")","v":88996394.470000058},null,0,null,0]
[null,null,"FOUR BEDROOM",null,{"$f":"GETPIVOTDATA(\"Sum of 4 Bedrooms, HCC\",'1. Determine Area HCC'!$C$29,\"Type\",\"Elevator\")","v":111245492.87999989},null,0,null,0]
[null,null,"FIVE BEDROOM",null,{"$f":"GETPIVOTDATA(\"Sum of 5 Bedrooms, HCC\",'1. Determine Area HCC'!$C$29,\"Type\",\"Elevator\")","v":126078225.20999998},null,0,null,0]
[null,null,"SIX BEDROOM",null,{"$f":"GETPIVOTDATA(\"Sum of 6 Bedrooms, HCC\",'1. Determine Area HCC'!$C$29,\"Type\",\"Elevator\")","v":140910957.66999993},null,0,null,0]
[null,null,"SUBTOTAL COST BY TYPE",null,null,null,{"$f":"SUM(G38:G44)","v":0},null,{"$f":"SUM(I37:I44)","v":0}]
[]
[null,null,"ROW HOUSE"]
[null,null,"ZERO BEDROOM",null,{"$f":"GETPIVOTDATA(\"Sum of 0 Bedrooms, HCC\",'1. Determine Area HCC'!$C$29,\"Type\",\"Row House\")","v":36218012.029999971},null,0,null,{"$f":"SUM(E48*G48)","v":0}]
[null,null,"ONE BEDROOM",null,{"$f":"GETPIVOTDATA(\"Sum of 1 Bedrooms, HCC\",'1. Determine Area HCC'!$C$29,\"Type\",\"Row House\")","v":47403153.729999989},null,0,null,0]
[null,null,"TWO BEDROOM",null,{"$f":"GETPIVOTDATA(\"Sum of 2 Bedrooms, HCC\",'1. Determine Area HCC'!$C$29,\"Type\",\"Row House\")","v":57383121.580000028},null,0,null,0]
{"$rows_left_out":18}
{"sheet":"3. Costs and Eligibility","index":3,"n_rows":64,"n_cols":28,"rows_kept":64,"cut":false,"hidden":false,"merged":[[35,2,35,4],[51,2,51,4],[57,2,57,4],[35,10,35,13],[49,13,51,15],[2,2,2,15],[11,2,11,16],[5,2,5,16],[6,2,6,16],[8,2,8,16],[9,2,9,16],[10,2,10,16],[12,2,12,16],[13,2,13,16],[17,4,17,9],[15,4,15,11],[16,4,16,11]]}
[]
[]
[null,null,"Input Rehabilitation Costs and Determine Eligibility"]
[]
[null,null,{"$f":"IF(Instructions!$E$5=\"\",\"Enter Property Name on Instructions Tab\",CONCATENATE(\"Property Name: \",Instructions!$E$5))","v":"Property Name: Sample Property Name"}]
[]
[null,null,{"$f":"IF(Instructions!$E$7=\"\",\"Enter Property Address on Instructions Tab\",CONCATENATE(\"Property Address: \",Instructions!$E$7))","v":"Property Address: Sample Property Address"}]
[]
[null,null,{"$f":"IF(Instructions!$E$9=\"\",\"Enter Unit Count on Instructions Tab\",CONCATENATE(\"Total Units: \",Instructions!$E$9))","v":"Total Units: 0"}]
{"$rows_empty":26}
[null,null,"A. Input Costs",{"$nulls":7},"B. Cap for General Requirements and Overhead & Profit"]
[]
[null,null,"Hard Rehab or Construction Costs",{"$nulls":7},"Hard Rehab Costs","Percent",null,"Dollar Cap",{"$nulls":12},"Total Overhead, Profit, & Gen Req."]
[]
[null,null,"10% Contingency",null,{"$f":"E38*0.1","v":0},{"$nulls":5},">$5,000,000",0.14000000000000001,null,{"$f":"IF(E38>5000000,0.14*E38,\"\")","v":""},{"$nulls":12},{"$f":"SUM(R40+R42)","v":0}]
[]
[null,null,"General Requirements",{"$nulls":7},"$2,500,001 to $5,000,000",0.15,null,{"$f":"IF(AND(E38>2500000,E38<=5000000),0.15*E38,\"\")","v":""},{"$nulls":12},{"$f":"SUM(R28*0.14)","v":0},0.14000000000000001]
[]
[null,null,"Overhead & Profit",{"$nulls":7},"1,000,001 to $2,500,000",0.16,null,{"$f":"IF(AND(E38>1000000,E38<=2500000),0.16*E38,\"\")","v":""},{"$nulls":12},{"$f":"SUM(R28*0.15)","v":0},0.15]
[]
[null,null,"Payment & Performance Bonds",{"$nulls":7},"$500,001 to $1,000,000",0.17,null,{"$f":"IF(AND(E38>500000,E38<=1000000),0.17*E38,\"\")","v":""},{"$nulls":12},{"$f":"SUM(R28*0.16)","v":0},0.16]
[]
[null,null,"Total Rehab or Construction Costs",null,{"$f":"SUM(E38:E46)","v":0},{"$nulls":5},"$500,000 and below",0.18,null,{"$f":"IF(E38<=500000,0.18*E38,\"\")","v":0},{"$nulls":12},{"$f":"SUM(R28*0.17)","v":0},0.17]
[{"$nulls":26},{"$f":"SUM(R28*0.18)","v":0},0.18]
[{"$nulls":10},"Sum of Gen. Req & Overhead & Profit:",{"$f":"SUM(E42,E44)","v":0},null,"Note: Sum of General Requirements and Overhead & Profit must be below the listed dollar cap."]
[]
[null,null,"C. Housing Construction Cost Thresholds"]
[null,null,"Total Housing Construction Cost Limit",null,{"$f":"'2. Input Unit Mix'!I67","v":0}]
[null,null,"30% of HCC",null,{"$f":"SUM(E53*0.3)","v":0}]
[null,null,"60% of HCC",null,{"$f":"SUM(E53*0.6)","v":0}]
[]
[]
[null,null,"D. Eligibility"]
[]
[null,null,"Eligible for up to $250 PUM Rent Increase?",null,{"$f":"IF(E48>E55,\"YES  (Total rehab exceeds 60% HCC)\",\"NO (Total rehab is less than 60% HCC)\")","v":"NO (Total rehab is less than 60% HCC)"}]
[null,null,"Eligible for up to $100 PUM Rent Increase?",null,{"$f":"IF(E60=\"YES  (Total rehab exceeds 60% HCC)\",\"N/A (Total rehab exceeds 60% HCC)\",IF(E48>E54,\"YES (Total rehab exceeds 30% HCC)\",\"NO (Total rehab is less than 30% HCC)\"))","v":"NO (Total rehab is less than 30% HCC)"}]
[{"$nulls":9},{"$f":"IF('1. Determine Area HCC'!D25=\"2020 or earlier\",_xlfn.IFNA(AND(MATCH('1. Determine Area HCC'!D26,#REF!,0),MATCH('1. Determine Area HCC'!D27,#REF!,0)),\"NO\"),IF('1. Determine Area HCC'!D25=2021,_xlfn.IFNA(AND(MATCH('1. Determine Area HCC'!D26,#REF!,0),MATCH('1. Determine Area HCC'!D27,#REF!,0)),\"NO\"),IF('1. Determine Area HCC'!D25=2022,_xlfn.IFNA(AND(MATCH('1. Determine Area HCC'!D26,#REF!,0),MATCH('1. Determine Area HCC'!D27,#REF!,0)),\"NO\"),\"Enter Year on Tab 1\")))","v":"Enter Year on Tab 1"}]
[]
[null,null,"Note: HUD will update this workbook with additional HCC year options as they become available. "]

{"sheet":"2022 TDC&HCC","index":4,"n_rows":1665,"n_cols":85,"rows_kept":1665,"cut":false,"hidden":true,"merged":[]}
["Region Order","Year","RegionLabel","StateName","StateAbbrev","City","Sort Order","Type","0 Bedrooms, HCC","0 Bedrooms, TDC","1 Bedrooms, HCC","1 Bedrooms, TDC","2 Bedrooms, HCC","2 Bedrooms, TDC","3 Bedrooms, HCC","3 Bedrooms, TDC","4 Bedrooms, HCC","4 Bedrooms, TDC","5 Bedrooms, HCC","5 Bedrooms, TDC","6 Bedrooms, HCC","6 Bedrooms, TDC",{"$nulls":9},"ALABAMA","ALASKA","ARIZONA","ARKANSAS","CALIFORNIA","COLORADO","CONNECTICUT","DELAWARE","DISTRICT OF COLUMBIA","FLORIDA","GEORGIA","GUAM","HAWAII","IDAHO","ILLINOIS","INDIANA","IOWA","KANSAS","KENTUCKY","LOUISIANA","MAINE","MARYLAND","MASSACHUSETTS","MICHIGAN","MINNESOTA","MISSISSIPPI","MISSOURI","MONTANA","NEBRASKA","NEVADA","NEW HAMPSHIRE","NEW JERSEY","NEW MEXICO","NEW YORK","NORTH CAROLINA","NORTH DAKOTA","OHIO","OKLAHOMA","OREGON","PENNSYLVANIA","PUERTO RICO","RHODE ISLAND","SOUTH CAROLINA","SOUTH DAKOTA","TENNESSEE","TEXAS","UTAH","VERMONT","VIRGIN ISLANDS","VIRGINIA","WASHINGTON","WEST VIRGINIA","WISCONSIN","WYOMING"]
[1,2022,"Region I - Northeast","CONNECTICUT","CT","BRIDGEPORT",1,"Detached/Semi-Detached",124084.39,217147.68,160842.14000000001,281473.74,192110.93,336194.13,228829.06,400450.85,269228.12,471149.21,295149.59999999998,516511.8,320166.93,560292.13]
[1,2022,"Region I - Northeast","CONNECTICUT","CT","BRIDGEPORT",2,"Row House",98165.69,171789.96,128412.48,224721.84,155374.04,271904.58,189759.98,332079.96999999997,224939.04,393643.32,247769.77,433597.09,269075.09999999998,470881.42]
[1,2022,"Region I - Northeast","CONNECTICUT","CT","BRIDGEPORT",3,"Walkup",94329,165075.76,128758.34,225327.09,163139.5,285494.13,215127.35,376472.87,266666.71000000002,466666.73,300527.94,525923.9,333990.52,584483.41]
[1,2022,"Region I - Northeast","CONNECTICUT","CT","BRIDGEPORT",4,"Elevator",100345.98,160553.57999999999,140484.38,224775.01,180622.77,288996.44,240830.36,385328.58,301037.95,481660.73,341176.35,545882.16,381314.74,610103.59]
[1,2022,"Region I - Northeast","CONNECTICUT","CT","HARTFORD",1,"Detached/Semi-Detached",125387.63,219428.35,162633.44,284608.53000000003,194336.72,340089.26,231604.1,405307.18,272571.58,477000.27,298860.19,523005.33,324274.28999999998,567480.02]
[1,2022,"Region I - Northeast","CONNECTICUT","CT","HARTFORD",2,"Row House",98551.45,172465.04,129055.84,225847.72,156299.41,273523.96999999997,191152.05,334516.09999999998,226714.75,396750.81,249803.2,437155.6,271373.90000000002,474904.32000000001]
[1,2022,"Region I - Northeast","CONNECTICUT","CT","HARTFORD",3,"Walkup",94211.43,164870,128476.84,224834.47,162692.37,284711.65999999997,214446.51,375281.39,265736.27,465038.48,299413.48,523973.59,332677.90999999997,582186.34]
[1,2022,"Region I - Northeast","CONNECTICUT","CT","HARTFORD",4,"Elevator",101061.54,161698.46,141486.15,226377.84,181910.76,291057.23,242547.68,388076.3,303184.59999999998,485095.38,343609.22,549774.76,384033.83,614454.14]
[1,2022,"Region I - Northeast","CONNECTICUT","CT","MERIDEN",1,"Detached/Semi-Detached",122371.76,214150.59,158606.21,277560.86,189426.82,331496.94,225612.55,394821.96,265431.46000000002,464505.06,290980.32,509215.56,315631.38,552354.92000000004]
[1,2022,"Region I - Northeast","CONNECTICUT","CT","MERIDEN",2,"Row House",96911.8,169595.66,126750.53,221813.42,153340.14000000001,268345.25,187234.96,327661.19,221926.26,388370.96,244439.07,427768.36,265443.82,464526.69]
[1,2022,"Region I - Northeast","CONNECTICUT","CT","MERIDEN",3,"Walkup",93200.55,163100.97,127236.95,222664.67,161226.03,282145.56,212618.4,372082.2,263570.2,461247.85,297048.56,519834.98,330135.31,577736.80000000005]
[1,2022,"Region I - Northeast","CONNECTICUT","CT","MERIDEN",4,"Elevator",99013.96,158422.34,138619.54999999999,221791.28,178225.13,285160.21999999997,237633.51,380213.63,297041.89,475267.03,336647.48,538635.97,376253.06,602004.91]
[1,2022,"Region I - Northeast","CONNECTICUT","CT","NEW BRITAIN",1,"Detached/Semi-Detached",123553.89,216219.3,160172,280301,191325.33,334819.32,227914.57,398850.49,268165.65999999997,469289.91,293992.61,514487.07,318926,558120.5]
[1,2022,"Region I - Northeast","CONNECTICUT","CT","NEW BRITAIN",2,"Row House",97635.19,170861.58,127742.35,223549.1,154588.44,270529.77,188845.49,330479.61,223876.58,391784.02,246612.78,431572.36,267834.15999999997,468709.79]
[1,2022,"Region I - Northeast","CONNECTICUT","CT","NEW BRITAIN",3,"Walkup",93735.39,164036.93,127927.27,223872.73,162070.99,283624.23,213702.67,373979.67,264885.84999999998,463550.24,298509.64,522391.87,331734.77,580535.85]
[1,2022,"Region I - Northeast","CONNECTICUT","CT","NEW BRITAIN",4,"Elevator",99858.86,159774.18,139802.41,223683.86,179745.95,287593.53000000003,239661.27,383458.04,299576.59000000003,479322.55,339520.13,543232.22,379463.67999999999,607141.9]
[1,2022,"Region I - Northeast","CONNECTICUT","CT","NEW HAVEN",1,"Detached/Semi-Detached",121189.64,212081.87,157040.41,274820.71999999997,187528.32000000001,328174.56,223310.53,390793.43,262697.27,459720.22,287968.03000000003,503944.05,312336.76,546589.32999999996]
[1,2022,"Region I - Northeast","CONNECTICUT","CT","NEW HAVEN",2,"Row House",96188.42,168329.73,125758.71,220077.74,152091.85,266160.74,185624.43,324842.76,219975.94,384957.9,242265.35,423964.37,263053.48,460343.6]
[1,2022,"Region I - Northeast","CONNECTICUT","CT","NEW HAVEN",3,"Walkup",92665.72,162165.01,126546.63,221456.6,160381.07999999999,280666.89,211534.13,370184.72,262254.55,458945.47,295587.48,517278.09,328535.86,574937.75]
[1,2022,"Region I - Northeast","CONNECTICUT","CT","NEW HAVEN",4,"Elevator",98169.06,157070.51,137436.69,219898.71,176704.32,282726.90999999997,235605.75,376969.21,294507.19,471211.52000000002,333774.82,534039.72,373042.44,596867.92000000004]
[1,2022,"Region I - Northeast","CONNECTICUT","CT","NEW LONDON",1,"Detached/Semi-Detached",123023.38,215290.91,159501.85999999999,279128.25,190539.71,333444.5,227000.07,397250.12,267103.19,467430.58,292835.61,512462.31,317685.06,555948.85]
[1,2022,"Region I - Northeast","CONNECTICUT","CT","NEW LONDON",2,"Row House",97104.68,169933.19,127072.2,222376.35,153802.82,269154.94,187930.99,328879.24,222814.11,389924.69,245455.77,429547.6,266593.21999999997,466538.13]
[1,2022,"Region I - Northeast","CONNECTICUT","CT","NEW LONDON",3,"Walkup",93141.759999999995,162998.07999999999,127096.2,222418.35,161002.46,281754.31,212277.97,371486.44,263104.96999999997,460433.71,296491.32,518859.8,329478.99,576588.24]
[1,2022,"Region I - Northeast","CONNECTICUT","CT","NEW LONDON",4,"Elevator",99371.74,158994.78,139120.43,222592.69,178869.13,286190.59999999998,238492.17,381587.47,298115.21000000002,476984.34,337863.9,540582.25,377612.6,604180.17000000004]
[1,2022,"Region I - Northeast","CONNECTICUT","CT","STAMFORD",1,"Detached/Semi-Detached",129403.95,226456.92,167888.22,293804.38,200654.21,351144.86,239188.15,418579.26,281532.03000000003,492681.05,308704.93,540233.63,334992.74,586237.30000000005]
[1,2022,"Region I - Northeast","CONNECTICUT","CT","STAMFORD",2,"Row House",101420.94,177486.64,132875.67000000001,232532.42,160991.37,281734.90000000002,197007.38,344762.91,233715.5,409002.12,257551.48,450715.09,279831.64,489705.37]
[1,2022,"Region I - Northeast","CONNECTICUT","CT","STAMFORD",3,"Walkup",96735.76,169287.58,131864.79,230763.38,166941.81,292148.15999999997,220006.58,385011.51,272587.13,477027.48,307102.82,537429.93000000005,341188.08,597079.14]
[1,2022,"Region I - Northeast","CONNECTICUT","CT","STAMFORD",4,"Elevator",104148.04,166636.85999999999,145807.25,233291.6,187466.47,299946.34999999998,249955.29,399928.47,312444.11,499910.58,354103.32,566565.32999999996,395762.54,633220.06999999995]
[1,2022,"Region I - Northeast","CONNECTICUT","CT","WATERBURY",1,"Detached/Semi-Detached",120598.58,211047.51,156257.51999999999,273450.65000000002,186579.07,326513.37,222159.52,388779.16,261330.17,457327.79,286461.88,501308.29,310689.45,543706.54]
[1,2022,"Region I - Northeast","CONNECTICUT","CT","WATERBURY",2,"Row House",95826.72,167696.76999999999,125262.8,219209.9,151467.70000000001,265068.48,184819.17,323433.53999999998,219000.78,383251.37,241178.5,422062.37,261858.31,458252.05]
[1,2022,"Region I - Northeast","CONNECTICUT","CT","WATERBURY",3,"Walkup",92398.3,161697.01999999999,126201.47,220852.57,159958.6,279927.55,210991.99,369235.98,261596.73,457794.28,294856.94,515999.65,327736.13,573538.22]
[1,2022,"Region I - Northeast","CONNECTICUT","CT","WATERBURY",4,"Elevator",97746.61,156394.59,136845.26,218952.42,175943.91,281510.25,234591.88,375347.01,293239.84000000003,469183.76,332338.49,531741.59,371437.14,594299.43000000005]
[1,2022,"Region I - Northeast","MAINE","ME","AUGUSTA",1,"Detached/Semi-Detached",110276.78,192984.36,143073.87,250379.28,170997.97,299246.44,203838.12,356716.71,239924.83,419868.46,263082.42,460394.23999999999,285486.2,499600.85]
[1,2022,"Region I - Northeast","MAINE","ME","AUGUSTA",2,"Row House",86422.399999999994,151239.20000000001,113227.11,198147.45,137187.03,240077.29,167880.74,293791.3,199163.2,348535.61,219476.2,384083.36,238463.62,417311.34]
[1,2022,"Region I - Northeast","MAINE","ME","AUGUSTA",3,"Walkup",82424.34,144242.6,112354.83,196620.95,142240.98000000001,248921.71,187453.16,328043.03999999998,232252.57,406442,261660.21,457905.36,290700.93,508726.63]
[1,2022,"Region I - Northeast","MAINE","ME","AUGUSTA",4,"Elevator",88749.99,141999.98000000001,124249.98,198799.97,159749.98000000001,255599.97,212999.97,340799.95,266249.96000000002,425999.94,301749.95,482799.93,337249.95,539599.93000000005]
[1,2022,"Region I - Northeast","MAINE","ME","BANGOR",1,"Detached/Semi-Detached",106260.46,185955.8,137819.12,241183.45,164680.49,288190.86,196254.09,343444.66,230964.41,404187.72,253237.71,443165.99,274767.78000000003,480843.61]
[1,2022,"Region I - Northeast","MAINE","ME","BANGOR",2,"Row House",83552.929999999993,146217.62,109407.29,191462.76,132495.07999999999,231866.39,162025.43,283544.51,192162.48,336284.33,211727.94,370523.9,230005.9,402510.33]
[1,2022,"Region I - Northeast","MAINE","ME","BANGOR",3,"Walkup",79900.02,139825.03,108966.89,190692.06,137991.56,241485.22,181893.11,318312.94,225401.73,394453.03,253970.89,444449.06,282190.78000000003,493833.86]
{"$rows_left_out":1625}