{"text_format":"2","workbook":"xlsx","n_sheets":5,"sheets":["Instructions","1. Determine Area HCC","2. Input Unit Mix","3. Costs and Eligibility","2022 TDC&HCC"],"not_rendered":{"charts":0,"images":0,"macros":0,"external_links":0,"defined_names":3,"comments":0,"pivot_tables":1},"unopened":[],"bounds":{"document_bytes":16777216,"sheet_cells":100000,"run_cost":"one","rows_first":2000,"rows_last":500,"rows_between":2000,"halvings":0,"cell_chars":16384,"cell_head_chars":4096},"cells_cut":0,"cells_raw":0,"read":"whole","date_system":"1900"}

{"sheet":"Instructions","index":0,"n_rows":9,"n_cols":5,"rows_kept":9,"cut":false,"hidden":false,"merged":[[4,4,4,7],[6,4,6,7],[29,2,29,7],[30,2,30,7],[31,2,31,7],[26,2,26,7],[27,2,27,7]]}
[]
[]
[null,null,"Worksheet to Determine RAD Section 202 PRAC Preservation Rent Increase Eligibility"]
[]
[null,null,"Property Name:",null,"Sample Property Name"]
[]
[null,null,"Property Address:",null,"Sample Property Address"]
[]
[null,null,"Total Units:",null,0]

{"sheet":"1. Determine Area HCC","index":1,"n_rows":87,"n_cols":10,"rows_kept":87,"cut":false,"hidden":false,"merged":[[34,6,38,8],[40,6,44,8],[28,6,32,8],[24,6,26,8]]}
[]
[]
[null,null,"Determining Housing Construction Costs in your Area"]
[]
[null,null,{"$f":"IF(Instructions!E5=\"\",\"Enter Property Name on Instructions Tab\",CONCATENATE(\"Property Name: \",Instructions!E5))","v":"Property Name: Sample Property Name"}]
[]
[null,null,{"$f":"IF(Instructions!E7=\"\",\"Enter Property Address on Instructions Tab\",CONCATENATE(\"Property Address: \",Instructions!E7))","v":"Property Address: Sample Property Address"}]
[]
[null,null,{"$f":"IF(Instructions!E9=\"\",\"Enter Unit Count on Instructions Tab\",CONCATENATE(\"Total Units: \",Instructions!E9))","v":"Total Units: 0"}]
{"$rows_empty":14}
[null,null,"Select the City/MSA and State for your project."]
[]
[null,null,"Select City --> ","(All)"]
[null,null,"Select State -->","(All)"]
[]
[null,null,"Type","Data","Total"]
[null,null,"Detached/Semi-Detached","Sum of 0 Bedrooms, TDC",80380115.389999971]
[null,null,null,"Sum of 1 Bedrooms, TDC",104224279.25999989]
[null,null,null,"Sum of 2 Bedrooms, TDC",124514090.70000018]
[null,null,null,"Sum of 3 Bedrooms, TDC",148352524.74000004]
[null,null,null,"Sum of 4 Bedrooms, TDC",174569108.73000002]
[null,null,null,"Sum of 5 Bedrooms, TDC",191391382.92999986]
[null,null,null,"Sum of 6 Bedrooms, TDC",207640631.23999983]
[null,null,null,"Sum of 0 Bedrooms, HCC",45931494.539999984]
[null,null,null,"Sum of 1 Bedrooms, HCC",59556731.069999985]
[null,null,null,"Sum of 2 Bedrooms, HCC",71150909.039999947]
[null,null,null,"Sum of 3 Bedrooms, HCC",84772871.320000023]
[null,null,null,"Sum of 4 Bedrooms, HCC",99753776.360000044]
[null,null,null,"Sum of 5 Bedrooms, HCC",109366504.40000001]
[null,null,null,"Sum of 6 Bedrooms, HCC",118651789.25000018]
[null,null,"Elevator","Sum of 0 Bedrooms, TDC",59330930.400000021]
[null,null,null,"Sum of 1 Bedrooms, TDC",83063302.680000186]
[null,null,null,"Sum of 2 Bedrooms, TDC",106795674.85000001]
[null,null,null,"Sum of 3 Bedrooms, TDC",142394232.83999985]
[null,null,null,"Sum of 4 Bedrooms, TDC",177992791.32000014]
[null,null,null,"Sum of 5 Bedrooms, TDC",201725163.49999991]
[null,null,null,"Sum of 6 Bedrooms, TDC",225457535.77999982]
[null,null,null,"Sum of 0 Bedrooms, HCC",37081830.949999996]
[null,null,null,"Sum of 1 Bedrooms, HCC",51914563.300000019]
[null,null,null,"Sum of 2 Bedrooms, HCC",66747295.79999993]
[null,null,null,"Sum of 3 Bedrooms, HCC",88996394.470000058]
[null,null,null,"Sum of 4 Bedrooms, HCC",111245492.87999989]
[null,null,null,"Sum of 5 Bedrooms, HCC",126078225.20999998]
[null,null,null,"Sum of 6 Bedrooms, HCC",140910957.66999993]
[null,null,"Row House","Sum of 0 Bedrooms, TDC",63381521.13000001]
[null,null,null,"Sum of 1 Bedrooms, TDC",82955519.179999962]
[null,null,null,"Sum of 2 Bedrooms, TDC",100420462.69000004]
[null,null,null,"Sum of 3 Bedrooms, TDC",122729350.21999994]
[null,null,null,"Sum of 4 Bedrooms, TDC",145522429.63999999]
[null,null,null,"Sum of 5 Bedrooms, TDC",160317654.83999991]
[null,null,null,"Sum of 6 Bedrooms, TDC",174132411.22]
[null,null,null,"Sum of 0 Bedrooms, HCC",36218012.029999971]
[null,null,null,"Sum of 1 Bedrooms, HCC",47403153.729999989]
[null,null,null,"Sum of 2 Bedrooms, HCC",57383121.580000028]
[null,null,null,"Sum of 3 Bedrooms, HCC",70131057.319999993]
[null,null,null,"Sum of 4 Bedrooms, HCC",83155674.109999925]
[null,null,null,"Sum of 5 Bedrooms, HCC",91610088.449999943]
[null,null,null,"Sum of 6 Bedrooms, HCC",99504235.000000075]
[null,null,"Walkup","Sum of 0 Bedrooms, TDC",60746312.409999974]
[null,null,null,"Sum of 1 Bedrooms, TDC",82879069.209999979]
[null,null,null,"Sum of 2 Bedrooms, TDC",104980232.44999996]
[null,null,null,"Sum of 3 Bedrooms, TDC",138404877.50999996]
[null,null,null,"Sum of 4 Bedrooms, TDC",171535379.03000012]
[null,null,null,"Sum of 5 Bedrooms, TDC",193295553.82999998]
[null,null,null,"Sum of 6 Bedrooms, TDC",214794267.62999997]
[null,null,null,"Sum of 0 Bedrooms, HCC",34712178.479999997]
[null,null,null,"Sum of 1 Bedrooms, HCC",47359468.149999991]
[null,null,null,"Sum of 2 Bedrooms, HCC",59988704.279999979]
[null,null,null,"Sum of 3 Bedrooms, HCC",79088501.449999973]
[null,null,null,"Sum of 4 Bedrooms, HCC",98020216.560000077]
[null,null,null,"Sum of 5 Bedrooms, HCC",110454602.27000003]
[null,null,null,"Sum of 6 Bedrooms, HCC",122739581.47000001]
[]
[{"$nulls":9},"form HUD-50156 (2/2016)"]

{"sheet":"2. Input Unit Mix","index":2,"n_rows":67,"n_cols":9,"rows_kept":67,"cut":false,"hidden":false,"merged":[[22,4,22,6],[22,8,23,8]]}
[]
[]
[null,null,"Input Unit Mix and Building Type"]
[]
[null,null,{"$f":"IF(Instructions!$E$5=\"\",\"Enter Property Name on Instructions Tab\",CONCATENATE(\"Property Name: \",Instructions!$E$5))","v":"Property Name: Sample Property Name"}]
[]
[null,null,{"$f":"IF(Instructions!$E$7=\"\",\"Enter Property Address on Instructions Tab\",CONCATENATE(\"Property Address: \",Instructions!$E$7))","v":"Property Address: Sample Property Address"}]
[]
[null,null,{"$f":"IF(Instructions!$E$9=\"\",\"Enter Unit Count on Instructions Tab\",CONCATENATE(\"Total Units: \",Instructions!$E$9))","v":"Total Units: 0"}]
{"$rows_empty":11}
[null,null,"A. Housing Construction Costs By Bedroom Type "]
[]
[null,null,"Metro Area Selected:",null,{"$f":"CONCATENATE('1. Determine Area HCC'!D26,\", \",'1. Determine Area HCC'!D27)","v":"(All), (All)"},null,null,null,{"$f":"IF(G67<>Instructions!E9,\"Reconcile Unit Count Discrepancy Between Instructions Tab and Unit Mix\",\"\")","v":""}]
[]
[]
[{"$nulls":4},"COST PER UNIT",null,"NUMBER OF UNITS",null,"TOTAL BY TYPE"]
[null,null,"DETACHED OR SEMI-DETACHED"]
[null,null,"ZERO BEDROOM",null,{"$f":"GETPIVOTDATA(\"Sum of 0 Bedrooms, HCC\",'1. Determine Area HCC'!$C$29,\"Type\",\"Detached/Semi-Detached\")","v":45931494.539999984},null,0,null,{"$f":"SUM(E28*G28)","v":0}]
[null,null,"ONE BEDROOM",null,{"$f":"GETPIVOTDATA(\"Sum of 1 Bedrooms, HCC\",'1. Determine Area HCC'!$C$29,\"Type\",\"Detached/Semi-Detached\")","v":59556731.069999985},null,0,null,{"$f":"SUM(E29*G29)","v":0}]
[null,null,"TWO BEDROOM",null,{"$f":"GETPIVOTDATA(\"Sum of 2 Bedrooms, HCC\",'1. Determine Area HCC'!$C$29,\"Type\",\"Detached/Semi-Detached\")","v":71150909.039999947},null,0,null,{"$f":"SUM(E30*G30)","v":0}]
[null,null,"THREE BEDROOM",null,{"$f":"GETPIVOTDATA(\"Sum of 3 Bedrooms, HCC\",'1. Determine Area HCC'!$C$29,\"Type\",\"Detached/Semi-Detached\")","v":84772871.320000023},null,0,null,0]
[null,null,"FOUR BEDROOM",null,{"$f":"GETPIVOTDATA(\"Sum of 4 Bedrooms, HCC\",'1. Determine Area HCC'!$C$29,\"Type\",\"Detached/Semi-Detached\")","v":99753776.360000044},null,0,null,0]
[null,null,"FIVE BEDROOM",null,{"$f":"GETPIVOTDATA(\"Sum of 5 Bedrooms, HCC\",'1. Determine Area HCC'!$C$29,\"Type\",\"Detached/Semi-Detached\")","v":109366504.40000001},null,0,null,0]
[null,null,"SIX BEDROOM",null,{"$f":"GETPIVOTDATA(\"Sum of 6 Bedrooms, HCC\",'1. Determine Area HCC'!$C$29,\"Type\",\"Detached/Semi-Detached\")","v":118651789.25000018},null,0,null,0]
[null,null,"SUBTOTAL COST BY TYPE",null,null,null,{"$f":"SUM(G28:G34)","v":0},null,{"$f":"SUM(I27:I34)","v":0}]
[]
[null,null,"ELEVATOR"]
[null,null,"ZERO BEDROOM",null,{"$f":"GETPIVOTDATA(\"Sum of 0 Bedrooms, HCC\",'1. Determine Area HCC'!$C$29,\"Type\",\"Elevator\")","v":37081830.949999996},null,0,null,{"$f":"SUM(E38*G38)","v":0}]
[null,null,"ONE BEDROOM",null,{"$f":"GETPIVOTDATA(\"Sum of 1 Bedrooms, HCC\",'1. Determine Area HCC'!$C$29,\"Type\",\"Elevator\")","v":51914563.300000019},null,0,null,0]
[null,null,"TWO BEDROOM",null,{"$f":"GETPIVOTDATA(\"Sum of 2 Bedrooms, HCC\",'1. Determine Area HCC'!$C$29,\"Type\",\"Elevator\")","v":66747295.79999993},null,0,null,0]
[null,null,"THREE BEDROOM",null,{"$f":"GETPIVOTDATA(\"Sum of 3 Bedrooms, HCC\",'1. Determine Area HCC'!$C$29,\"Type\",\"Elevator\")","v":88996394.470000058},null,0,null,0]
[null,null,"FOUR BEDROOM",null,{"$f":"GETPIVOTDATA(\"Sum of 4 Bedrooms, HCC\",'1. Determine Area HCC'!$C$29,\"Type\",\"Elevator\")","v":111245492.87999989},null,0,null,0]
[null,null,"FIVE BEDROOM",null,{"$f":"GETPIVOTDATA(\"Sum of 5 Bedrooms, HCC\",'1. Determine Area HCC'!$C$29,\"Type\",\"Elevator\")","v":126078225.20999998},null,0,null,0]
[null,null,"SIX BEDROOM",null,{"$f":"GETPIVOTDATA(\"Sum of 6 Bedrooms, HCC\",'1. Determine Area HCC'!$C$29,\"Type\",\"Elevator\")","v":140910957.66999993},null,0,null,0]
[null,null,"SUBTOTAL COST BY TYPE",null,null,null,{"$f":"SUM(G38:G44)","v":0},null,{"$f":"SUM(I37:I44)","v":0}]
[]
[null,null,"ROW HOUSE"]
[null,null,"ZERO BEDROOM",null,{"$f":"GETPIVOTDATA(\"Sum of 0 Bedrooms, HCC\",'1. Determine Area HCC'!$C$29,\"Type\",\"Row House\")","v":36218012.029999971},null,0,null,{"$f":"SUM(E48*G48)","v":0}]
[null,null,"ONE BEDROOM",null,{"$f":"GETPIVOTDATA(\"Sum of 1 Bedrooms, HCC\",'1. Determine Area HCC'!$C$29,\"Type\",\"Row House\")","v":47403153.729999989},null,0,null,0]
[null,null,"TWO BEDROOM",null,{"$f":"GETPIVOTDATA(\"Sum of 2 Bedrooms, HCC\",'1. Determine Area HCC'!$C$29,\"Type\",\"Row House\")","v":57383121.580000028},null,0,null,0]
[null,null,"THREE BEDROOM",null,{"$f":"GETPIVOTDATA(\"Sum of 3 Bedrooms, HCC\",'1. Determine Area HCC'!$C$29,\"Type\",\"Row House\")","v":70131057.319999993},null,0,null,0]
[null,null,"FOUR BEDROOM",null,{"$f":"GETPIVOTDATA(\"Sum of 4 Bedrooms, HCC\",'1. Determine Area HCC'!$C$29,\"Type\",\"Row House\")","v":83155674.109999925},null,0,null,0]
[null,null,"FIVE BEDROOM",null,{"$f":"GETPIVOTDATA(\"Sum of 5 Bedrooms, HCC\",'1. Determine Area HCC'!$C$29,\"Type\",\"Row House\")","v":91610088.449999943},null,0,null,0]
[null,null,"SIX BEDROOM",null,{"$f":"GETPIVOTDATA(\"Sum of 6 Bedrooms, HCC\",'1. Determine Area HCC'!$C$29,\"Type\",\"Row House\")","v":99504235.000000075},null,0,null,0]
[null,null,"SUBTOTAL COST BY TYPE",null,null,null,{"$f":"SUM(G48:G54)","v":0},null,{"$f":"SUM(I47:I54)","v":0}]
[]
[null,null,"WALK UP"]
[null,null,"ZERO BEDROOM",null,{"$f":"GETPIVOTDATA(\"Sum of 0 Bedrooms, HCC\",'1. Determine Area HCC'!$C$29,\"Type\",\"Walkup\")","v":34712178.479999997},null,0,null,{"$f":"SUM(E58*G58)","v":0}]
[null,null,"ONE BEDROOM",null,{"$f":"GETPIVOTDATA(\"Sum of 1 Bedrooms, HCC\",'1. Determine Area HCC'!$C$29,\"Type\",\"Walkup\")","v":47359468.149999991},null,0,null,0]
[null,null,"TWO BEDROOM",null,{"$f":"GETPIVOTDATA(\"Sum of 2 Bedrooms, HCC\",'1. Determine Area HCC'!$C$29,\"Type\",\"Walkup\")","v":59988704.279999979},null,0,null,0]
[null,null,"THREE BEDROOM",null,{"$f":"GETPIVOTDATA(\"Sum of 3 Bedrooms, HCC\",'1. Determine Area HCC'!$C$29,\"Type\",\"Walkup\")","v":79088501.449999973},null,0,null,0]
[null,null,"FOUR BEDROOM",null,{"$f":"GETPIVOTDATA(\"Sum of 4 Bedrooms, HCC\",'1. Determine Area HCC'!$C$29,\"Type\",\"Walkup\")","v":98020216.560000077},null,0,null,0]
[null,null,"FIVE BEDROOM",null,{"$f":"GETPIVOTDATA(\"Sum of 5 Bedrooms, HCC\",'1. Determine Area HCC'!$C$29,\"Type\",\"Walkup\")","v":110454602.27000003},null,0,null,0]
[null,null,"SIX BEDROOM",null,{"$f":"GETPIVOTDATA(\"Sum of 6 Bedrooms, HCC\",'1. Determine Area HCC'!$C$29,\"Type\",\"Walkup\")","v":122739581.47000001},null,0,null,0]
[null,null,"SUBTOTAL COST BY TYPE",null,null,null,{"$f":"SUM(G58:G64)","v":0},null,{"$f":"SUM(I58:I64)","v":0}]
[]
[null,null,"TOTAL UNITS and HCC ",null,null,null,{"$f":"SUM(G35+G45+G55+G65)","v":0},null,{"$f":"SUM(I35+I45+I55+I65)","v":0}]

{"sheet":"3. Costs and Eligibility","index":3,"n_rows":64,"n_cols":28,"rows_kept":64,"cut":false,"hidden":false,"merged":[[35,2,35,4],[51,2,51,4],[57,2,57,4],[35,10,35,13],[49,13,51,15],[2,2,2,15],[11,2,11,16],[5,2,5,16],[6,2,6,16],[8,2,8,16],[9,2,9,16],[10,2,10,16],[12,2,12,16],[13,2,13,16],[17,4,17,9],[15,4,15,11],[16,4,16,11]]}
[]
[]
[null,null,"Input Rehabilitation Costs and Determine Eligibility"]
[]
[null,null,{"$f":"IF(Instructions!$E$5=\"\",\"Enter Property Name on Instructions Tab\",CONCATENATE(\"Property Name: \",Instructions!$E$5))","v":"Property Name: Sample Property Name"}]
[]
[null,null,{"$f":"IF(Instructions!$E$7=\"\",\"Enter Property Address on Instructions Tab\",CONCATENATE(\"Property Address: \",Instructions!$E$7))","v":"Property Address: Sample Property Address"}]
[]
[null,null,{"$f":"IF(Instructions!$E$9=\"\",\"Enter Unit Count on Instructions Tab\",CONCATENATE(\"Total Units: \",Instructions!$E$9))","v":"Total Units: 0"}]
{"$rows_empty":26}
[null,null,"A. Input Costs",{"$nulls":7},"B. Cap for General Requirements and Overhead & Profit"]
[]
[null,null,"Hard Rehab or Construction Costs",{"$nulls":7},"Hard Rehab Costs","Percent",null,"Dollar Cap",{"$nulls":12},"Total Overhead, Profit, & Gen Req."]
[]
[null,null,"10% Contingency",null,{"$f":"E38*0.1","v":0},{"$nulls":5},">$5,000,000",0.14000000000000001,null,{"$f":"IF(E38>5000000,0.14*E38,\"\")","v":""},{"$nulls":12},{"$f":"SUM(R40+R42)","v":0}]
[]
[null,null,"General Requirements",{"$nulls":7},"$2,500,001 to $5,000,000",0.15,null,{"$f":"IF(AND(E38>2500000,E38<=5000000),0.15*E38,\"\")","v":""},{"$nulls":12},{"$f":"SUM(R28*0.14)","v":0},0.14000000000000001]
[]
[null,null,"Overhead & Profit",{"$nulls":7},"1,000,001 to $2,500,000",0.16,null,{"$f":"IF(AND(E38>1000000,E38<=2500000),0.16*E38,\"\")","v":""},{"$nulls":12},{"$f":"SUM(R28*0.15)","v":0},0.15]
[]
[null,null,"Payment & Performance Bonds",{"$nulls":7},"$500,001 to $1,000,000",0.17,null,{"$f":"IF(AND(E38>500000,E38<=1000000),0.17*E38,\"\")","v":""},{"$nulls":12},{"$f":"SUM(R28*0.16)","v":0},0.16]
[]
[null,null,"Total Rehab or Construction Costs",null,{"$f":"SUM(E38:E46)","v":0},{"$nulls":5},"$500,000 and below",0.18,null,{"$f":"IF(E38<=500000,0.18*E38,\"\")","v":0},{"$nulls":12},{"$f":"SUM(R28*0.17)","v":0},0.17]
[{"$nulls":26},{"$f":"SUM(R28*0.18)","v":0},0.18]
[{"$nulls":10},"Sum of Gen. Req & Overhead & Profit:",{"$f":"SUM(E42,E44)","v":0},null,"Note: Sum of General Requirements and Overhead & Profit must be below the listed dollar cap."]
[]
[null,null,"C. Housing Construction Cost Thresholds"]
[null,null,"Total Housing Construction Cost Limit",null,{"$f":"'2. Input Unit Mix'!I67","v":0}]
[null,null,"30% of HCC",null,{"$f":"SUM(E53*0.3)","v":0}]
[null,null,"60% of HCC",null,{"$f":"SUM(E53*0.6)","v":0}]
[]
[]
[null,null,"D. Eligibility"]
[]
[null,null,"Eligible for up to $250 PUM Rent Increase?",null,{"$f":"IF(E48>E55,\"YES  (Total rehab exceeds 60% HCC)\",\"NO (Total rehab is less than 60% HCC)\")","v":"NO (Total rehab is less than 60% HCC)"}]
[null,null,"Eligible for up to $100 PUM Rent Increase?",null,{"$f":"IF(E60=\"YES  (Total rehab exceeds 60% HCC)\",\"N/A (Total rehab exceeds 60% HCC)\",IF(E48>E54,\"YES (Total rehab exceeds 30% HCC)\",\"NO (Total rehab is less than 30% HCC)\"))","v":"NO (Total rehab is less than 30% HCC)"}]
[{"$nulls":9},{"$f":"IF('1. Determine Area HCC'!D25=\"2020 or earlier\",_xlfn.IFNA(AND(MATCH('1. Determine Area HCC'!D26,#REF!,0),MATCH('1. Determine Area HCC'!D27,#REF!,0)),\"NO\"),IF('1. Determine Area HCC'!D25=2021,_xlfn.IFNA(AND(MATCH('1. Determine Area HCC'!D26,#REF!,0),MATCH('1. Determine Area HCC'!D27,#REF!,0)),\"NO\"),IF('1. Determine Area HCC'!D25=2022,_xlfn.IFNA(AND(MATCH('1. Determine Area HCC'!D26,#REF!,0),MATCH('1. Determine Area HCC'!D27,#REF!,0)),\"NO\"),\"Enter Year on Tab 1\")))","v":"Enter Year on Tab 1"}]
[]
[null,null,"Note: HUD will update this workbook with additional HCC year options as they become available. "]

{"sheet":"2022 TDC&HCC","index":4,"n_rows":1665,"n_cols":85,"rows_kept":1665,"cut":false,"hidden":true,"merged":[]}
["Region Order","Year","RegionLabel","StateName","StateAbbrev","City","Sort Order","Type","0 Bedrooms, HCC","0 Bedrooms, TDC","1 Bedrooms, HCC","1 Bedrooms, TDC","2 Bedrooms, HCC","2 Bedrooms, TDC","3 Bedrooms, HCC","3 Bedrooms, TDC","4 Bedrooms, HCC","4 Bedrooms, TDC","5 Bedrooms, HCC","5 Bedrooms, TDC","6 Bedrooms, HCC","6 Bedrooms, TDC",{"$nulls":9},"ALABAMA","ALASKA","ARIZONA","ARKANSAS","CALIFORNIA","COLORADO","CONNECTICUT","DELAWARE","DISTRICT OF COLUMBIA","FLORIDA","GEORGIA","GUAM","HAWAII","IDAHO","ILLINOIS","INDIANA","IOWA","KANSAS","KENTUCKY","LOUISIANA","MAINE","MARYLAND","MASSACHUSETTS","MICHIGAN","MINNESOTA","MISSISSIPPI","MISSOURI","MONTANA","NEBRASKA","NEVADA","NEW HAMPSHIRE","NEW JERSEY","NEW MEXICO","NEW YORK","NORTH CAROLINA","NORTH DAKOTA","OHIO","OKLAHOMA","OREGON","PENNSYLVANIA","PUERTO RICO","RHODE ISLAND","SOUTH CAROLINA","SOUTH DAKOTA","TENNESSEE","TEXAS","UTAH","VERMONT","VIRGIN ISLANDS","VIRGINIA","WASHINGTON","WEST VIRGINIA","WISCONSIN","WYOMING"]
[1,2022,"Region I - Northeast","CONNECTICUT","CT","BRIDGEPORT",1,"Detached/Semi-Detached",124084.39,217147.68,160842.14000000001,281473.74,192110.93,336194.13,228829.06,400450.85,269228.12,471149.21,295149.59999999998,516511.8,320166.93,560292.13]
[1,2022,"Region I - Northeast","CONNECTICUT","CT","BRIDGEPORT",2,"Row House",98165.69,171789.96,128412.48,224721.84,155374.04,271904.58,189759.98,332079.96999999997,224939.04,393643.32,247769.77,433597.09,269075.09999999998,470881.42]
[1,2022,"Region I - Northeast","CONNECTICUT","CT","BRIDGEPORT",3,"Walkup",94329,165075.76,128758.34,225327.09,163139.5,285494.13,215127.35,376472.87,266666.71000000002,466666.73,300527.94,525923.9,333990.52,584483.41]
[1,2022,"Region I - Northeast","CONNECTICUT","CT","BRIDGEPORT",4,"Elevator",100345.98,160553.57999999999,140484.38,224775.01,180622.77,288996.44,240830.36,385328.58,301037.95,481660.73,341176.35,545882.16,381314.74,610103.59]
[1,2022,"Region I - Northeast","CONNECTICUT","CT","HARTFORD",1,"Detached/Semi-Detached",125387.63,219428.35,162633.44,284608.53000000003,194336.72,340089.26,231604.1,405307.18,272571.58,477000.27,298860.19,523005.33,324274.28999999998,567480.02]
[1,2022,"Region I - Northeast","CONNECTICUT","CT","HARTFORD",2,"Row House",98551.45,172465.04,129055.84,225847.72,156299.41,273523.96999999997,191152.05,334516.09999999998,226714.75,396750.81,249803.2,437155.6,271373.90000000002,474904.32000000001]
[1,2022,"Region I - Northeast","CONNECTICUT","CT","HARTFORD",3,"Walkup",94211.43,164870,128476.84,224834.47,162692.37,284711.65999999997,214446.51,375281.39,265736.27,465038.48,299413.48,523973.59,332677.90999999997,582186.34]
[1,2022,"Region I - Northeast","CONNECTICUT","CT","HARTFORD",4,"Elevator",101061.54,161698.46,141486.15,226377.84,181910.76,291057.23,242547.68,388076.3,303184.59999999998,485095.38,343609.22,549774.76,384033.83,614454.14]
[1,2022,"Region I - Northeast","CONNECTICUT","CT","MERIDEN",1,"Detached/Semi-Detached",122371.76,214150.59,158606.21,277560.86,189426.82,331496.94,225612.55,394821.96,265431.46000000002,464505.06,290980.32,509215.56,315631.38,552354.92000000004]
[1,2022,"Region I - Northeast","CONNECTICUT","CT","MERIDEN",2,"Row House",96911.8,169595.66,126750.53,221813.42,153340.14000000001,268345.25,187234.96,327661.19,221926.26,388370.96,244439.07,427768.36,265443.82,464526.69]
[1,2022,"Region I - Northeast","CONNECTICUT","CT","MERIDEN",3,"Walkup",93200.55,163100.97,127236.95,222664.67,161226.03,282145.56,212618.4,372082.2,263570.2,461247.85,297048.56,519834.98,330135.31,577736.80000000005]
[1,2022,"Region I - Northeast","CONNECTICUT","CT","MERIDEN",4,"Elevator",99013.96,158422.34,138619.54999999999,221791.28,178225.13,285160.21999999997,237633.51,380213.63,297041.89,475267.03,336647.48,538635.97,376253.06,602004.91]
[1,2022,"Region I - Northeast","CONNECTICUT","CT","NEW BRITAIN",1,"Detached/Semi-Detached",123553.89,216219.3,160172,280301,191325.33,334819.32,227914.57,398850.49,268165.65999999997,469289.91,293992.61,514487.07,318926,558120.5]
[1,2022,"Region I - Northeast","CONNECTICUT","CT","NEW BRITAIN",2,"Row House",97635.19,170861.58,127742.35,223549.1,154588.44,270529.77,188845.49,330479.61,223876.58,391784.02,246612.78,431572.36,267834.15999999997,468709.79]
[1,2022,"Region I - Northeast","CONNECTICUT","CT","NEW BRITAIN",3,"Walkup",93735.39,164036.93,127927.27,223872.73,162070.99,283624.23,213702.67,373979.67,264885.84999999998,463550.24,298509.64,522391.87,331734.77,580535.85]
[1,2022,"Region I - Northeast","CONNECTICUT","CT","NEW BRITAIN",4,"Elevator",99858.86,159774.18,139802.41,223683.86,179745.95,287593.53000000003,239661.27,383458.04,299576.59000000003,479322.55,339520.13,543232.22,379463.67999999999,607141.9]
[1,2022,"Region I - Northeast","CONNECTICUT","CT","NEW HAVEN",1,"Detached/Semi-Detached",121189.64,212081.87,157040.41,274820.71999999997,187528.32000000001,328174.56,223310.53,390793.43,262697.27,459720.22,287968.03000000003,503944.05,312336.76,546589.32999999996]
[1,2022,"Region I - Northeast","CONNECTICUT","CT","NEW HAVEN",2,"Row House",96188.42,168329.73,125758.71,220077.74,152091.85,266160.74,185624.43,324842.76,219975.94,384957.9,242265.35,423964.37,263053.48,460343.6]
[1,2022,"Region I - Northeast","CONNECTICUT","CT","NEW HAVEN",3,"Walkup",92665.72,162165.01,126546.63,221456.6,160381.07999999999,280666.89,211534.13,370184.72,262254.55,458945.47,295587.48,517278.09,328535.86,574937.75]
[1,2022,"Region I - Northeast","CONNECTICUT","CT","NEW HAVEN",4,"Elevator",98169.06,157070.51,137436.69,219898.71,176704.32,282726.90999999997,235605.75,376969.21,294507.19,471211.52000000002,333774.82,534039.72,373042.44,596867.92000000004]
[1,2022,"Region I - Northeast","CONNECTICUT","CT","NEW LONDON",1,"Detached/Semi-Detached",123023.38,215290.91,159501.85999999999,279128.25,190539.71,333444.5,227000.07,397250.12,267103.19,467430.58,292835.61,512462.31,317685.06,555948.85]
[1,2022,"Region I - Northeast","CONNECTICUT","CT","NEW LONDON",2,"Row House",97104.68,169933.19,127072.2,222376.35,153802.82,269154.94,187930.99,328879.24,222814.11,389924.69,245455.77,429547.6,266593.21999999997,466538.13]
[1,2022,"Region I - Northeast","CONNECTICUT","CT","NEW LONDON",3,"Walkup",93141.759999999995,162998.07999999999,127096.2,222418.35,161002.46,281754.31,212277.97,371486.44,263104.96999999997,460433.71,296491.32,518859.8,329478.99,576588.24]
[1,2022,"Region I - Northeast","CONNECTICUT","CT","NEW LONDON",4,"Elevator",99371.74,158994.78,139120.43,222592.69,178869.13,286190.59999999998,238492.17,381587.47,298115.21000000002,476984.34,337863.9,540582.25,377612.6,604180.17000000004]
[1,2022,"Region I - Northeast","CONNECTICUT","CT","STAMFORD",1,"Detached/Semi-Detached",129403.95,226456.92,167888.22,293804.38,200654.21,351144.86,239188.15,418579.26,281532.03000000003,492681.05,308704.93,540233.63,334992.74,586237.30000000005]
[1,2022,"Region I - Northeast","CONNECTICUT","CT","STAMFORD",2,"Row House",101420.94,177486.64,132875.67000000001,232532.42,160991.37,281734.90000000002,197007.38,344762.91,233715.5,409002.12,257551.48,450715.09,279831.64,489705.37]
[1,2022,"Region I - Northeast","CONNECTICUT","CT","STAMFORD",3,"Walkup",96735.76,169287.58,131864.79,230763.38,166941.81,292148.15999999997,220006.58,385011.51,272587.13,477027.48,307102.82,537429.93000000005,341188.08,597079.14]
[1,2022,"Region I - Northeast","CONNECTICUT","CT","STAMFORD",4,"Elevator",104148.04,166636.85999999999,145807.25,233291.6,187466.47,299946.34999999998,249955.29,399928.47,312444.11,499910.58,354103.32,566565.32999999996,395762.54,633220.06999999995]
[1,2022,"Region I - Northeast","CONNECTICUT","CT","WATERBURY",1,"Detached/Semi-Detached",120598.58,211047.51,156257.51999999999,273450.65000000002,186579.07,326513.37,222159.52,388779.16,261330.17,457327.79,286461.88,501308.29,310689.45,543706.54]
[1,2022,"Region I - Northeast","CONNECTICUT","CT","WATERBURY",2,"Row House",95826.72,167696.76999999999,125262.8,219209.9,151467.70000000001,265068.48,184819.17,323433.53999999998,219000.78,383251.37,241178.5,422062.37,261858.31,458252.05]
[1,2022,"Region I - Northeast","CONNECTICUT","CT","WATERBURY",3,"Walkup",92398.3,161697.01999999999,126201.47,220852.57,159958.6,279927.55,210991.99,369235.98,261596.73,457794.28,294856.94,515999.65,327736.13,573538.22]
[1,2022,"Region I - Northeast","CONNECTICUT","CT","WATERBURY",4,"Elevator",97746.61,156394.59,136845.26,218952.42,175943.91,281510.25,234591.88,375347.01,293239.84000000003,469183.76,332338.49,531741.59,371437.14,594299.43000000005]
[1,2022,"Region I - Northeast","MAINE","ME","AUGUSTA",1,"Detached/Semi-Detached",110276.78,192984.36,143073.87,250379.28,170997.97,299246.44,203838.12,356716.71,239924.83,419868.46,263082.42,460394.23999999999,285486.2,499600.85]
[1,2022,"Region I - Northeast","MAINE","ME","AUGUSTA",2,"Row House",86422.399999999994,151239.20000000001,113227.11,198147.45,137187.03,240077.29,167880.74,293791.3,199163.2,348535.61,219476.2,384083.36,238463.62,417311.34]
[1,2022,"Region I - Northeast","MAINE","ME","AUGUSTA",3,"Walkup",82424.34,144242.6,112354.83,196620.95,142240.98000000001,248921.71,187453.16,328043.03999999998,232252.57,406442,261660.21,457905.36,290700.93,508726.63]
[1,2022,"Region I - Northeast","MAINE","ME","AUGUSTA",4,"Elevator",88749.99,141999.98000000001,124249.98,198799.97,159749.98000000001,255599.97,212999.97,340799.95,266249.96000000002,425999.94,301749.95,482799.93,337249.95,539599.93000000005]
[1,2022,"Region I - Northeast","MAINE","ME","BANGOR",1,"Detached/Semi-Detached",106260.46,185955.8,137819.12,241183.45,164680.49,288190.86,196254.09,343444.66,230964.41,404187.72,253237.71,443165.99,274767.78000000003,480843.61]
[1,2022,"Region I - Northeast","MAINE","ME","BANGOR",2,"Row House",83552.929999999993,146217.62,109407.29,191462.76,132495.07999999999,231866.39,162025.43,283544.51,192162.48,336284.33,211727.94,370523.9,230005.9,402510.33]
[1,2022,"Region I - Northeast","MAINE","ME","BANGOR",3,"Walkup",79900.02,139825.03,108966.89,190692.06,137991.56,241485.22,181893.11,318312.94,225401.73,394453.03,253970.89,444449.06,282190.78000000003,493833.86]
[1,2022,"Region I - Northeast","MAINE","ME","BANGOR",4,"Elevator",85663.49,137061.59,119928.89,191886.23,154194.29,246710.86,205592.38,328947.82,256990.48,411184.77,291255.88,466009.41,325521.27,520834.05]
[1,2022,"Region I - Northeast","MAINE","ME","LEWISTON",1,"Detached/Semi-Detached",110807.28,193912.74,143744.01,251552.02,171783.57,300621.25,204752.61,358317.06,240987.29,421727.77,264239.40999999997,462418.97,286727.13,501772.48]
[1,2022,"Region I - Northeast","MAINE","ME","LEWISTON",2,"Row House",86952.9,152167.57999999999,113897.25,199320.18,137972.63,241452.1,168795.23,295391.65999999997,200225.67,350394.91,220633.19,386108.09,239704.55,419482.97]
[1,2022,"Region I - Northeast","MAINE","ME","LEWISTON",3,"Walkup",83017.960000000006,145281.43,113185.89,198075.31,143309.49,250791.61,188877.85,330536.23,234033.43,409558.5,263678.51,461437.39,292956.68,512674.19]
[1,2022,"Region I - Northeast","MAINE","ME","LEWISTON",4,"Elevator",89237.11,142779.37,124931.95,199891.12,160626.79,257002.87,214169.06,342670.5,267711.32,428338.12,303406.17,485449.87,339101.01,542561.62]
[1,2022,"Region I - Northeast","MAINE","ME","PORTLAND",1,"Detached/Semi-Detached",111337.78,194841.12,144414.15,252724.76,172569.17,301996.06,205667.1,359917.42,242049.75,423587.07,265396.40000000002,464443.7,287968.06,503944.11]
[1,2022,"Region I - Northeast","MAINE","ME","PORTLAND",2,"Row House",87483.41,153095.96,114567.38,200492.92,138758.23000000001,242826.91,169709.72,296992.01,201288.13,352254.22,221790.18,388132.82,240945.49,421654.6]
[1,2022,"Region I - Northeast","MAINE","ME","PORTLAND",3,"Walkup",83611.58,146320.26999999999,114016.96000000001,199529.68,144378,252661.5,190302.53,333029.43,235814.28,412674.99,265696.81,464969.42,295212.43,516621.75]
[1,2022,"Region I - Northeast","MAINE","ME","PORTLAND",4,"Elevator",89724.23,143558.76999999999,125613.92,200982.28,161503.60999999999,258405.78,215338.15,344541.04,269172.69,430676.3,305062.38,488099.81,340952.07,545523.31999999995]
[1,2022,"Region I - Northeast","MAINE","ME","WATERVILLE",1,"Detached/Semi-Detached",103486.83,181101.95,134242.92000000001,234925.1,160425.18,280744.06,191208.61,334615.06,225042.84,393824.96,246754.45,431820.28,267750.36,468563.14]
[1,2022,"Region I - Northeast","MAINE","ME","WATERVILLE",2,"Row House",81238.03,142166.56,106405.07,186208.87,128889.97,225557.45,157671.44,275925.01,187024.77,327293.36,206083.26,360645.71,223892.77,391812.34]
[1,2022,"Region I - Northeast","MAINE","ME","WATERVILLE",3,"Walkup",77584.33,135772.57999999999,105783.37,185120.9,133941.06,234396.86,176534.79,308935.88,218743.52,382801.16,246454.9,431296.08,273824.07,479192.13]
[1,2022,"Region I - Northeast","MAINE","ME","WATERVILLE",4,"Elevator",83357.23,133371.57,116700.12,186720.2,150043.01999999999,240068.83,200057.35,320091.77,250071.69,400114.71,283414.58,453463.34,316757.48,506811.97]
[1,2022,"Region I - Northeast","MASSACHUSETTS","MA","BOSTON",1,"Detached/Semi-Detached",135481.72,237093.01,175710.75,307493.82,209950.45,367413.28,250193.61,437838.82,294437.64,515265.88,322828.44,564949.77,350268.5,612969.88]
[1,2022,"Region I - Northeast","MASSACHUSETTS","MA","BOSTON",2,"Row House",106581.23,186517.14,139550.25,244212.94,168987.19,295727.58,206629.86,361602.26,245053.36,428843.38,269997.83,472496.2,293298.84000000003,513272.97]
[1,2022,"Region I - Northeast","MASSACHUSETTS","MA","BOSTON",3,"Walkup",101960.76,178431.33,139062.89000000001,243360.06,176111.31,308194.78000000003,232147.91,406258.83,287684.40999999997,503447.72,324153.09000000003,567267.91,360177.24,630310.17000000004]
[1,2022,"Region I - Northeast","MASSACHUSETTS","MA","BOSTON",4,"Elevator",109247.67999999999,174796.29,152946.76,244714.81,196645.83,314633.33,262194.44,419511.11,327743.05,524388.88,371442.12,594307.4,415141.19,664225.92000000004]
[1,2022,"Region I - Northeast","MASSACHUSETTS","MA","LAWRENCE",1,"Detached/Semi-Detached",126918.58,222107.51999999999,164531.1,287929.42,196529.9,343927.32,234111.06,409694.36,275454.34000000003,482045.09,301982.02,528468.53,327590.73,573283.77]
[1,2022,"Region I - Northeast","MASSACHUSETTS","MA","LAWRENCE",2,"Row House",100311.78,175545.61,131240.48000000001,229670.84,158817.69,277930.96000000002,194004.76,339508.32,229989.44,402481.53,253344.31,443352.55,275142.46999999997,481499.32]
[1,2022,"Region I - Northeast","MASSACHUSETTS","MA","LAWRENCE",3,"Walkup",96318.49,168557.36,131455.95000000001,230047.92,166543.96,291451.93,219603.13,384305.47,272201.89,476353.3,306756.17,536823.29,340901.2,596577.1]
[1,2022,"Region I - Northeast","MASSACHUSETTS","MA","LAWRENCE",4,"Elevator",102587.58,164140.12,143622.60999999999,229796.17,184657.64,295452.21999999997,246210.18,393936.29,307762.73,492420.37,348797.76,558076.42000000004,389832.79,623732.47]
[1,2022,"Region I - Northeast","MASSACHUSETTS","MA","LOWELL",1,"Detached/Semi-Detached",127509.64,223141.87,165313.99,289299.49,197479.15,345588.51,235262.07,411708.62,276821.44,484437.51,303488.15999999997,531104.28,329238.03999999998,576166.56000000006]
[1,2022,"Region I - Northeast","MASSACHUSETTS","MA","LOWELL",2,"Row House",100673.47,176178.57,131736.39000000001,230538.68,159441.84,279023.21999999997,194810.02,340917.54,230964.6,404188.06,254431.17,445254.54,276337.64,483590.87]
[1,2022,"Region I - Northeast","MASSACHUSETTS","MA","LOWELL",3,"Walkup",96585.91,169025.34,131801.10999999999,230651.95,166966.44,292191.27,220145.26,385254.21,272859.71000000002,477504.5,307486.71000000002,538101.74,341700.93,597976.63]
[1,2022,"Region I - Northeast","MASSACHUSETTS","MA","LOWELL",4,"Elevator",103010.03,164816.04,144214.03,230742.46,185418.04,296668.88,247224.06,395558.5,309030.07,494448.13,350234.08,560374.54,391438.09,626300.96]
[1,2022,"Region I - Northeast","MASSACHUSETTS","MA","NEW BEDFORD",1,"Detached/Semi-Detached",124736.01,218288.02,161737.79,283041.14,193223.83,338141.7,230216.58,402879.02,270899.86,474074.75,297004.90000000002,519758.58,322220.62,563886.09]
[1,2022,"Region I - Northeast","MASSACHUSETTS","MA","NEW BEDFORD",2,"Row House",98358.58,172127.51,128734.16,225284.79,155836.73000000001,272714.28000000003,190456.02,333298.03999999998,225826.9,395197.08,248786.49,435376.36,270224.5,472892.88]
[1,2022,"Region I - Northeast","MASSACHUSETTS","MA","NEW BEDFORD",3,"Walkup",94270.22,164972.89000000001,128617.59,225080.79,162915.94,285102.90000000002,214786.94,375877.14,266201.5,465852.62,299970.71999999997,524948.76,333334.23,583334.9]
[1,2022,"Region I - Northeast","MASSACHUSETTS","MA","NEW BEDFORD",4,"Elevator",100703.76,161126.01999999999,140985.26999999999,225576.43,181266.77,290026.84000000003,241689.03,386702.45,302111.28999999998,483378.07,342392.79,547828.47999999998,382674.3,612278.88]
[1,2022,"Region I - Northeast","MASSACHUSETTS","MA","PITTSFIELD",1,"Detached/Semi-Detached",117415.56,205477.22,152236.70000000001,266414.21999999997,181865.43,318264.5,216672.58,379177.01,254955.39,446171.94,279519.93,489159.88,303243.84999999998,530676.73]
[1,2022,"Region I - Northeast","MASSACHUSETTS","MA","PITTSFIELD",2,"Row House",92643.7,162126.48000000001,121241.98,212173.46,146754.07,256819.62,179332.22,313831.39,212626.01,372095.51,234236.55,409913.96,254412.71,445222.24]
[1,2022,"Region I - Northeast","MASSACHUSETTS","MA","PITTSFIELD",3,"Walkup",88836.58,155464.01999999999,121215.07,212126.37,153547.51,268708.15000000002,202443.87,354276.78,250911.58,439095.27,282747.11,494807.43,314201.61,549852.81000000006]
[1,2022,"Region I - Northeast","MASSACHUSETTS","MA","PITTSFIELD",4,"Elevator",94823.88,151718.21,132753.44,212405.5,170682.99,273092.78999999998,227577.32,364123.71,284471.65000000002,455154.64,322401.2,515841.93,360330.75,576529.21]
[1,2022,"Region I - Northeast","MASSACHUSETTS","MA","SPRINGFIELD",1,"Detached/Semi-Detached",124857.12,218499.97,161963.31,283435.78999999998,193551.11,338714.45,230689.61,403706.82,271509.12,475140.97,297703.2,520980.6,323033.36,565308.39]
[1,2022,"Region I - Northeast","MASSACHUSETTS","MA","SPRINGFIELD",2,"Row House",98020.95,171536.66,128385.7,224674.98,155513.81,272149.15999999997,190237.57,332915.74,225652.29,394891.51,248646.21,435130.86,270132.96999999997,472732.69]
[1,2022,"Region I - Northeast","MASSACHUSETTS","MA","SPRINGFIELD",3,"Walkup",93617.81,163831.17000000001,127645.78,223380.11,161623.85999999999,282841.76,213021.83,372788.2,263955.42,461921.98,297395.18,520441.56,330422.15999999997,578238.78]
[1,2022,"Region I - Northeast","MASSACHUSETTS","MA","SPRINGFIELD",4,"Elevator",100574.41,160919.06,140804.18,225286.69,181033.95,289654.32,241378.59,386205.76,301723.24,482757.19,341953.01,547124.81999999995,382182.77,611492.44999999995]
[1,2022,"Region I - Northeast","MASSACHUSETTS","MA","WORCESTER",1,"Detached/Semi-Detached",123493.33,216113.32,160059.24,280103.67,191161.68,334532.94,227678.05,398436.58,267861.02,468756.79,293643.45,513876.04,318519.62,557409.34]
[1,2022,"Region I - Northeast","MASSACHUSETTS","MA","WORCESTER",2,"Row House",97804,171157,127916.57,223854,154749.9,270812.32,188954.72,330670.76,223963.88,391936.79,246682.91,431695.09,267879.93,468789.87]
[1,2022,"Region I - Northeast","MASSACHUSETTS","MA","WORCESTER",3,"Walkup",94061.59,164607.78,128413.18,224723.06,162717.01999999999,284754.78999999998,214585.22,375524.13,266008.88,465515.54,299797.40000000002,524645.46,333190.78999999998,583083.88]
[1,2022,"Region I - Northeast","MASSACHUSETTS","MA","WORCESTER",4,"Elevator",99923.53,159877.66,139892.95000000001,223828.72,179862.36,287779.78000000003,239816.48,383706.38,299770.59999999998,479632.97,339740.02,543584.04,379709.43,607535.1]
[1,2022,"Region I - Northeast","NEW HAMPSHIRE","NH","CONCORD",1,"Detached/Semi-Detached",109322.36,191314.13,141614.41,247825.23,169066.84,295866.96999999997,201268,352218.99,236729.91,414277.34,259481.34,454092.35,281400.63,492451.09]
[1,2022,"Region I - Northeast","NEW HAMPSHIRE","NH","CONCORD",2,"Row House",87073.57,152378.74,113776.57,199108.99,137531.63,240680.35,167730.82999999999,293528.95,198711.85,347745.74,218810.16,382917.77,237543.03,415700.3]
[1,2022,"Region I - Northeast","NEW HAMPSHIRE","NH","CONCORD",3,"Walkup",84114.14,147199.74,114925.1,201118.93,145694.72,254965.75,192206.32,336361.07,238332.94,417082.65,268656.25,470148.43,298637.34000000003,522615.34]
[1,2022,"Region I - Northeast","NEW HAMPSHIRE","NH","CONCORD",4,"Elevator",88715.57,141944.91,124201.8,198722.88,159688.01999999999,255500.84,212917.36,340667.79,266146.7,425834.73,301632.93,482612.7,337119.16,539390.66]
[1,2022,"Region I - Northeast","NEW HAMPSHIRE","NH","KEENE",1,"Detached/Semi-Detached",105608.84,184815.47,136923.46,239616.06,163567.6,286243.3,194866.57,341016.49,229292.68,401262.19,251382.41,439919.22,272714.09999999998,477249.67]
[1,2022,"Region I - Northeast","NEW HAMPSHIRE","NH","KEENE",2,"Row House",83360.05,145880.07999999999,109085.61,190899.83,132032.39000000001,231056.69,161329.4,282326.45,191274.62,334730.59000000003,210711.23,368744.64,228856.5,400498.88]
[1,2022,"Region I - Northeast","NEW HAMPSHIRE","NH","KEENE",3,"Walkup",79958.81,139927.91,109107.64,190938.37,138215.12,241876.46,182233.53,318908.68,225866.95,395267.16,254528.12,445424.22,282847.08,494982.39]
[1,2022,"Region I - Northeast","NEW HAMPSHIRE","NH","KEENE",4,"Elevator",85305.72,136489.15,119428,191084.81,153550.29,245680.47,204733.72,327573.96000000002,255917.15,409467.45,290039.44,464063.11,324161.73,518658.77]
[1,2022,"Region I - Northeast","NEW HAMPSHIRE","NH","LITTLETON",1,"Detached/Semi-Detached",105427.16,184497.53,136585.17000000001,239024.05,163076.65,285384.14,194157,339774.75,228378.76,399662.83,250334.93,438086.13,271494.95,475116.17]
[1,2022,"Region I - Northeast","NEW HAMPSHIRE","NH","LITTLETON",2,"Row House",83866.47,146766.32,109608.29,191814.51,132516.76,231904.34,161657.06,282899.86,191536.52,335188.90000000002,210921.62,369112.83,228993.78,400739.11]
[1,2022,"Region I - Northeast","NEW HAMPSHIRE","NH","LITTLETON",3,"Walkup",80937.41,141640.46,110565.35,193489.36,140153.22,245268.14,184881.17,323542.05,229236.03,401163.06,258391.4,452184.96,287215.14,502626.5]
[1,2022,"Region I - Northeast","NEW HAMPSHIRE","NH","LITTLETON",4,"Elevator",85499.73,136799.57,119699.62,191519.4,153899.51,246239.22,205199.35,328318.96999999997,256499.19,410398.71,290699.08,465118.53,324898.96999999997,519838.36]
[1,2022,"Region I - Northeast","NEW HAMPSHIRE","NH","MANCHESTER",1,"Detached/Semi-Detached",112868.73,197520.28,146311.79999999999,256045.64,174762.35,305834.11,208174.05,364304.59,244932.5,428631.88,268518.21999999997,469906.88,291284.47999999998,509747.85]
[1,2022,"Region I - Northeast","NEW HAMPSHIRE","NH","MANCHESTER",2,"Row House",89243.73,156176.51999999999,116752.02,204316.04,141276.51,247233.9,172562.42,301984.23,204562.81,357984.92,225331.29,394329.76,244714.05,428249.59]
[1,2022,"Region I - Northeast","NEW HAMPSHIRE","NH","MANCHESTER",3,"Walkup",85718.64,150007.62,116996.06,204743.11,148229.57999999999,259401.77,195459.14,342053.49,242279.89,423989.8,273039.49,477819.11,303435.71000000002,531012.49]
[1,2022,"Region I - Northeast","NEW HAMPSHIRE","NH","MANCHESTER",4,"Elevator",91250.27,146000.43,127750.37,204400.6,164250.48000000001,262800.77,219000.64,350401.03,273750.8,438001.28,310250.90000000002,496401.45,346751.01,554801.63]
[1,2022,"Region I - Northeast","NEW HAMPSHIRE","NH","NASHUA",1,"Detached/Semi-Detached",119309.86,208792.26,154810.91,270919.09000000003,185040.48,323820.84000000003,220598.64,386047.62,259665.97,454415.44,284736.68,498289.2,308998.53000000003,540747.43000000005]
[1,2022,"Region I - Northeast","NEW HAMPSHIRE","NH","NASHUA",2,"Row House",93391.16,163434.54,122381.25,214167.19,148303.59,259531.28,181529.57,317676.75,215376.89,376909.55,237356.85,415374.49,257906.7,451336.72]
[1,2022,"Region I - Northeast","NEW HAMPSHIRE","NH","NASHUA",3,"Walkup",88986.43,155726.26,121278.74,212237.8,153522.88,268665.03000000003,202305.18,354034.07,250638.99,438618.24,282363.2,494135.61,313688.75,548955.31000000006]
[1,2022,"Region I - Northeast","NEW HAMPSHIRE","NH","NASHUA",4,"Elevator",95961.89,153539.01999999999,134346.64000000001,214954.63,172731.4,276370.24,230308.53,368493.66,287885.67,460617.07,326270.42,522032.68,364655.18,583448.29]
[1,2022,"Region I - Northeast","NEW HAMPSHIRE","NH","PORTSMOUTH",1,"Detached/Semi-Detached",110216.22,192878.38,142961.10999999999,250181.95,170834.32,298960.06,203601.6,356302.8,239620.2,419335.34,262733.26,459783.21,285079.82,498889.68]
[1,2022,"Region I - Northeast","NEW HAMPSHIRE","NH","PORTSMOUTH",2,"Row House",86591.21,151534.62,113401.34,198452.34,137348.48000000001,240359.85,167989.97,293982.44,199250.5,348688.38,219546.34,384206.09,238509.38,417391.42]
[1,2022,"Region I - Northeast","NEW HAMPSHIRE","NH","PORTSMOUTH",3,"Walkup",82750.55,144813.45000000001,112840.73,197471.28,142887.01,250052.27,188335.71,329587.49,233375.6,408407.31,262947.96999999997,460158.95,292156.95,511274.66]
[1,2022,"Region I - Northeast","NEW HAMPSHIRE","NH","PORTSMOUTH",4,"Elevator",88814.66,142103.45000000001,124340.52,198944.84,159866.38,255786.22,213155.18,341048.29,266443.96999999997,426310.36,301969.84000000003,483151.75,337495.7,539993.13]
[1,2022,"Region I - Northeast","RHODE ISLAND","RI","NEWPORT",1,"Detached/Semi-Detached",120128.63,210225.1,155700.13,272475.24,185957.1,325424.93,221481.54,387592.7,260572.33,456001.58,285654.03000000003,499894.56,309854.88,542246.05000000005]
[1,2022,"Region I - Northeast","RHODE ISLAND","RI","NEWPORT",2,"Row House",95127.41,166472.95999999999,124418.43,217732.25,150520.63,263411.11,183795.44,321642.03000000003,217851.01,381239.26,239951.35999999999,419914.88,260571.61,456000.31]
[1,2022,"Region I - Northeast","RHODE ISLAND","RI","NEWPORT",3,"Walkup",91478.47,160087.32999999999,124884.49,218547.86,158244.04,276927.07,208684.74,365198.3,258692.82,452712.44,291550.84999999998,510213.99,324024.33,567042.57999999996]
[1,2022,"Region I - Northeast","RHODE ISLAND","RI","NEWPORT",4,"Elevator",97194.82,155511.71,136072.74,217716.39,174950.67,279921.08,233267.56,373228.1,291584.45,466535.13,330462.38,528739.81000000006,369340.3,590944.49]
[1,2022,"Region I - Northeast","RHODE ISLAND","RI","PROVIDENCE",1,"Detached/Semi-Detached",125918.14,220356.74,163303.59,285781.28000000003,195122.33,341464.08,232518.6,406907.55,273634.06,478859.6,300017.19,525030.09,325515.24,569651.67000000004]
[1,2022,"Region I - Northeast","RHODE ISLAND","RI","PROVIDENCE",2,"Row House",99081.96,173393.43,129725.98,227020.47,157085.03,274898.78999999998,192066.56,336116.47,227777.22,398610.14,250960.2,439180.35,272614.84000000003,477075.98]
[1,2022,"Region I - Northeast","RHODE ISLAND","RI","PROVIDENCE",3,"Walkup",94805.06,165908.85,129307.92,226288.85,163760.9,286581.57,215871.21,377774.62,267517.15000000002,468155.01,301431.8,527505.66,334933.68,586133.93999999994]
[1,2022,"Region I - Northeast","RHODE ISLAND","RI","PROVIDENCE",4,"Elevator",101548.66,162477.85999999999,142168.13,227469.01,182787.59,292460.15000000002,243716.79,389946.87,304645.99,487433.58,345265.45,552424.73,385884.91,617415.87]
[1,2022,"Region I - Northeast","VERMONT","VT","BRATTLEBORO",1,"Detached/Semi-Detached",110625.60000000001,193594.8,143405.73000000001,250960.02,171292.63,299762.09999999998,204043.05,357075.34,240073.38,420128.41,263191.94,460585.9,285507.99,499638.99]
[1,2022,"Region I - Northeast","VERMONT","VT","BRATTLEBORO",2,"Row House",87459.33,153053.82999999999,114419.93,200234.87,138457,242299.76,169122.9,295965.08,200487.56,350853.24,220843.59,386476.29,239841.84,419723.22]
[1,2022,"Region I - Northeast","VERMONT","VT","BRATTLEBORO",3,"Walkup",83996.57,146993.99,114643.61,200626.31,145247.59,254183.29,191525.49,335169.61,237402.52,415454.41,267541.78999999998,468198.14,297324.74,520318.3]
[1,2022,"Region I - Northeast","VERMONT","VT","BRATTLEBORO",4,"Elevator",89431.12,143089.79999999999,125203.57,200325.72,160976.01999999999,257561.63,214634.69,343415.51,268293.37,429269.39,304065.81,486505.31,339838.26,543741.23]
[1,2022,"Region I - Northeast","VERMONT","VT","BURLINGTON",1,"Detached/Semi-Detached",110686.16,193700.78,143518.49,251157.35,171456.28,300048.48,204279.57,357489.25,240378.02,420661.53,263541.09999999998,461196.92,285914.37,500350.15]
[1,2022,"Region I - Northeast","VERMONT","VT","BURLINGTON",2,"Row House",87290.52,152758.41,114245.7,199929.98,138295.54999999999,242017.21,169013.68,295773.94,200400.26,350700.46,220773.46,386353.56,239796.08,419643.13]
[1,2022,"Region I - Northeast","VERMONT","VT","BURLINGTON",3,"Walkup",83670.36,146423.14000000001,114157.7,199775.98,144601.56,253052.73,190642.94,333625.15000000002,236279.49,413489.1,266254.03000000003,465944.56,295868.71999999997,517770.26]
[1,2022,"Region I - Northeast","VERMONT","VT","BURLINGTON",4,"Elevator",89366.45,142986.32,125113.03,200180.85,160859.60999999999,257375.38,214479.48,343167.17,268099.34999999998,428958.97,303845.93,486153.5,339592.51,543348.03]
[1,2022,"Region I - Northeast","VERMONT","VT","MONTPELIER",1,"Detached/Semi-Detached",112338.23,196591.9,145641.66,254872.9,173976.74,304459.3,207259.56,362704.23,243870.04,426772.58,267361.23,467882.15,290043.55,507576.22]
[1,2022,"Region I - Northeast","VERMONT","VT","MONTPELIER",2,"Row House",88713.22,155248.14000000001,116081.89,203143.3,140490.91,245859.09,171647.93,300383.88,203500.35,356125.62,224174.3,392305.03,243473.12,426077.96]
[1,2022,"Region I - Northeast","VERMONT","VT","MONTPELIER",3,"Walkup",85125.02,148968.79,116165,203288.75,147161.07,257531.87,194034.45,339560.29,240499.03,420873.31,271021.19,474287.08,301179.96000000002,527064.93000000005]
[1,2022,"Region I - Northeast","VERMONT","VT","MONTPELIER",4,"Elevator",90763.15,145221.03,127068.4,203309.45,163373.66,261397.86,217831.55,348530.48,272289.44,435663.1,308594.69,493751.52,344899.95,551839.93000000005]
[1,2022,"Region I - Northeast","VERMONT","VT","RUTLAND",1,"Detached/Semi-Detached",110216.22,192878.38,142961.10999999999,250181.95,170834.32,298960.06,203601.6,356302.8,239620.2,419335.34,262733.26,459783.21,285079.82,498889.68]
[1,2022,"Region I - Northeast","VERMONT","VT","RUTLAND",2,"Row House",86591.21,151534.62,113401.34,198452.34,137348.48000000001,240359.85,167989.97,293982.44,199250.5,348688.38,219546.34,384206.09,238509.38,417391.42]
[1,2022,"Region I - Northeast","VERMONT","VT","RUTLAND",3,"Walkup",82750.55,144813.45000000001,112840.73,197471.28,142887.01,250052.27,188335.71,329587.49,233375.6,408407.31,262947.96999999997,460158.95,292156.95,511274.66]
[1,2022,"Region I - Northeast","VERMONT","VT","RUTLAND",4,"Elevator",88814.66,142103.45000000001,124340.52,198944.84,159866.38,255786.22,213155.18,341048.29,266443.96999999997,426310.36,301969.84000000003,483151.75,337495.7,539993.13]
[10,2022,"Region X - Northwest","ALASKA","AK","ANCHORAGE",1,"Detached/Semi-Detached",126338.6,221092.54,163632.69,286357.2,195332.88,341832.55,232507.27,406887.72,273454.59000000003,478545.53,299724.74,524518.30000000005,325023.90000000002,568791.82999999996]
[10,2022,"Region X - Northwest","ALASKA","AK","ANCHORAGE",2,"Row House",100780.33,176365.58,131654.01,230394.52,159106.87,278437.03000000003,193981.5,339467.63,229781.41,402117.47,253003.79,442756.63,274642.57,480624.49]
[10,2022,"Region X - Northwest","ALASKA","AK","ANCHORAGE",3,"Walkup",97470.49,170573.35,133202.34,233104.09,168886.69,295551.7,222823.53,389941.18,276318.11,483556.69,311489.77,545107.09,346268.3,605969.53]
[10,2022,"Region X - Northwest","ALASKA","AK","ANCHORAGE",4,"Elevator",102604.86,164167.78,143646.81,229834.9,184688.75,295502.01,246251.67,394002.68,307814.59000000003,492503.35,348856.53,558170.46,389898.48,623837.57999999996]
[10,2022,"Region X - Northwest","ALASKA","AK","FAIRBANKS",1,"Detached/Semi-Detached",129539.96,226694.93,167710.35,293493.11,200142.36,350249.14,238148.52,416759.91,280036.34999999998,490063.62,306908.26,537089.46,332758.21999999997,582326.88]
[10,2022,"Region X - Northwest","ALASKA","AK","FAIRBANKS",2,"Row House",103768.71,181595.24,135465.18,237064.07,163614.47,286325.32,199301.71,348777.99,235999.23,412998.66,259797.97,454646.45,281957.03999999998,493424.82]
[10,2022,"Region X - Northwest","ALASKA","AK","FAIRBANKS",3,"Walkup",100686.9,176202.08,137678.18,240936.82,174621.56,305587.74,230450.38,403288.16,285833.24,500208.17,322259.65999999997,563954.4,358289.68,627006.93999999994]
[10,2022,"Region X - Northwest","ALASKA","AK","FAIRBANKS",4,"Elevator",105432.75,168692.4,147605.85,236169.36,189778.95,303646.32,253038.6,404861.76,316298.25,506077.2,358471.35,573554.16,400644.44,641031.12]
[10,2022,"Region X - Northwest","ALASKA","AK","JUNEAU",1,"Detached/Semi-Detached",132339.19,231593.58,171515.74,300152.53999999998,204837.12,358464.97,243955.39,426921.94,287004.55,502257.96,314625.78999999998,550595.14,341272.57,597226.99]
[10,2022,"Region X - Northwest","ALASKA","AK","JUNEAU",2,"Row House",104864.06,183512.11,137138.66,239992.66,165894.17000000001,290314.78999999998,202540.2,354445.35,240055.89,420097.8,264400.78000000003,462701.36,287112.64,502447.11]
[10,2022,"Region X - Northwest","ALASKA","AK","JUNEAU",3,"Walkup",100892.57,176561.99,137749.03,241060.79,174554.42,305470.23,230203.6,402856.3,285377.34999999998,499410.37,321631.59999999998,562855.30000000005,357463.24,625560.67000000004]
[10,2022,"Region X - Northwest","ALASKA","AK","JUNEAU",4,"Elevator",107109.58,171375.33,149953.41,239925.46,192797.24,308475.59000000003,257062.99,411300.78,321328.73,514125.98,364172.56,582676.11,407016.39,651226.24]
[10,2022,"Region X - Northwest","ALASKA","AK","KETCHIKAN",1,"Detached/Semi-Detached",133930.70000000001,234378.73,173526.15,303670.77,207193.95,362589.41,246698.87,431723.02,290191.94,507835.9,318096.78000000003,556669.36,344995.38,603741.91]
[10,2022,"Region X - Northwest","ALASKA","AK","KETCHIKAN",2,"Row House",106455.57,186297.25,139149.07999999999,243510.89,168250.99,294439.23,205283.68,359246.44,243243.28,425675.74,267871.76,468775.58,290835.45,508962.03]
[10,2022,"Region X - Northwest","ALASKA","AK","KETCHIKAN",3,"Walkup",102673.43,179678.5,140242.23000000001,245423.91,177759.97,311079.95,234477.67,410335.92,290719.94,508759.89,327686.53000000003,573451.43000000005,364230.52,637403.4]
[10,2022,"Region X - Northwest","ALASKA","AK","KETCHIKAN",4,"Elevator",108570.95,173713.52,151999.32,243198.92,195427.7,312684.33,260570.27,416912.44,325712.84000000003,521140.55,369141.22,590625.96,412569.59999999998,660111.35999999999]
[10,2022,"Region X - Northwest","IDAHO","ID","BOISE",1,"Detached/Semi-Detached",109312.51,191296.9,141894.29,248315.01,169648.52,296884.90000000002,202316.13,354053.22,238188.25,416829.43,261209.81,457117.16,283511.56,496145.23]
[10,2022,"Region X - Northwest","IDAHO","ID","BOISE",2,"Row House",85214.73,149125.76999999999,111742.97,195550.2,135492.57,237111.99,165991.84,290485.71999999997,197010.68,344768.69,217158.63,380027.6,236009.16,413016.04]
[10,2022,"Region X - Northwest","IDAHO","ID","BOISE",3,"Walkup",80927.28,141622.73000000001,110227.92,192898.86,139483.78,244096.61,183754.43,321570.25,227608.1,398314.17,256380.56,448665.98,284782.36,498369.13]
[10,2022,"Region X - Northwest","IDAHO","ID","BOISE",4,"Elevator",87736.93,140379.1,122831.71,196530.74,157926.48000000001,252682.37,210568.64,336909.83,263210.8,421137.29,298305.58,477288.93,333400.34999999998,533440.56999999995]
[10,2022,"Region X - Northwest","IDAHO","ID","COEUR D'ALENE",1,"Detached/Semi-Detached",112362.35,196634.12,145673.60999999999,254928.83,174015.49,304527.09999999998,207306.54,362786.45,243925.84,426870.22,267422.7,467989.73,290110.78999999998,507693.88]
[10,2022,"Region X - Northwest","IDAHO","ID","COEUR D'ALENE",2,"Row House",88727.99,155273.97,116102.13,203178.72,140516.38,245903.67,171680.8,300441.40000000002,203540.15,356195.27,224218.66,392382.66,243521.9,426163.33]
[10,2022,"Region X - Northwest","IDAHO","ID","COEUR D'ALENE",3,"Walkup",85135.94,148987.89000000001,116179.09,203313.4,147178.31,257562.05,194056.58,339599.02,240525.88,420920.29,271051.01,474339.26,301212.59999999998,527122.05000000005]
[10,2022,"Region X - Northwest","IDAHO","ID","COEUR D'ALENE",4,"Elevator",90780.39,145248.62,127092.54,203348.07,163404.70000000001,261447.52,217872.93,348596.69,272341.15999999997,435745.87,308653.32,493845.32,344965.47,551944.77]
[10,2022,"Region X - Northwest","IDAHO","ID","IDAHO FALLS",1,"Detached/Semi-Detached",108251.51,189440.14,140554.01999999999,245969.54,168077.31,294135.28999999998,200487.15,350852.51,236063.33,413110.82,258895.83,453067.7,281029.7,491801.97]
[10,2022,"Region X - Northwest","IDAHO","ID","IDAHO FALLS",2,"Row House",84153.72,147269.01,110402.7,193204.73,133921.35999999999,234362.37,164162.85999999999,287285,194885.76000000001,341050.08,214844.65,375978.14,233527.3,408672.78]
[10,2022,"Region X - Northwest","IDAHO","ID","IDAHO FALLS",3,"Walkup",79740.039999999994,139545.07,108565.79,189990.13,137346.75,240356.81,180905.06,316583.86,224046.39,392081.18,252343.95,441601.92,280270.86,490474.01]
[10,2022,"Region X - Northwest","IDAHO","ID","IDAHO FALLS",4,"Elevator",86762.69,138820.31,121467.77,194348.43,156172.85,249876.56,208230.46,333168.74,260288.08,416460.93,294993.15000000002,471989.05,329698.23,527517.18000000005]
[10,2022,"Region X - Northwest","IDAHO","ID","LEWISTON",1,"Detached/Semi-Detached",109973.98,192454.47,142510.07,249392.63,170179.74,297814.53999999998,202655.53,354647.17,238401.65,417202.88,261336.64,457339.13,283454.31,496045.05]
[10,2022,"Region X - Northwest","IDAHO","ID","LEWISTON",2,"Row House",87266.45,152716.29,114098.25,199671.94,137994.32,241490.06,168426.87,294747.02,199599.71,349299.49,219826.88,384697.04,238692.44,417711.77]
[10,2022,"Region X - Northwest","IDAHO","ID","LEWISTON",3,"Walkup",84055.35,147096.87,114784.36,200872.63,145471.16,254574.53,191865.91,335765.35,237867.73,416268.54,268099.03000000003,469173.3,297981.05,521466.83]
[10,2022,"Region X - Northwest","IDAHO","ID","LEWISTON",4,"Elevator",89073.35,142517.35999999999,124702.68,199524.3,160332.01999999999,256531.24,213776.03,342041.65,267220.03999999998,427552.07,302849.38,484559.01,338478.72,541565.94999999995]
[10,2022,"Region X - Northwest","IDAHO","ID","POCATELLO",1,"Detached/Semi-Detached",106327.05,186072.34,137939.87,241394.76,164853.82999999999,288494.2,196502.36,343879.12,231283,404745.25,253602.23,443803.91,275190.96999999997,481584.19]
[10,2022,"Region X - Northwest","IDAHO","ID","POCATELLO",2,"Row House",83387.81,145928.66,109238.13,191166.72,132339.99,231594.98,161924.43,283367.75,192085.13,336148.97,211668.9,370420.57,229972.34,402451.59]
[10,2022,"Region X - Northwest","IDAHO","ID","POCATELLO",3,"Walkup",79576.55,139258.96,108484.51,189847.89,137349.82999999999,240362.21,181016.09,316778.15999999997,224285.41,392499.48,252690.58,442208.52,280742.92,491300.1]
[10,2022,"Region X - Northwest","IDAHO","ID","POCATELLO",4,"Elevator",85603.13,136965.01,119844.39,191751.02,154085.64000000001,246537.03,205447.52,328716.03000000003,256809.4,410895.04,291050.65000000002,465681.05,325291.90000000002,520467.05]
[10,2022,"Region X - Northwest","IDAHO","ID","TWIN FALLS",1,"Detached/Semi-Detached",109245.92,191180.37,141773.54,248103.7,169475.18,296581.57,202067.86,353618.76,237869.66,416271.9,260845.28,456479.24,283088.37,495404.65]
[10,2022,"Region X - Northwest","IDAHO","ID","TWIN FALLS",2,"Row House",85379.85,149414.73000000001,111912.14,195846.24,135647.66,237383.4,166092.85,290662.48,197088.03,344904.05,217217.67,380130.92,236042.73,413074.78]
[10,2022,"Region X - Northwest","IDAHO","ID","TWIN FALLS",3,"Walkup",81250.75,142188.81,110710.3,193743.03,140125.5,245219.62,184631.45,323105.03000000003,228724.42,400267.73,257660.86,450906.51,286230.21999999997,500902.89]
[10,2022,"Region X - Northwest","IDAHO","ID","TWIN FALLS",4,"Elevator",87797.3,140475.67000000001,122916.21,196665.94,158035.13,252856.21,210713.51,337141.62,263391.89,421427.02,298510.8,477617.29,333629.71999999997,533807.56000000006]
[10,2022,"Region X - Northwest","OREGON","OR","BEND",1,"Detached/Semi-Detached",117173.31,205053.3,151785.65,265624.88,181210.84,317118.96000000002,215726.49,377521.36,253736.83,444039.45,278123.28999999998,486715.77,301618.32,527832.06999999995]
[10,2022,"Region X - Northwest","OREGON","OR","BEND",2,"Row House",93318.94,163308.14000000001,121938.88,213393.04,147399.89000000001,257949.82,179769.11,314595.95,212975.2,372706.6,234517.08,410404.88,254595.75,445542.56]
[10,2022,"Region X - Northwest","OREGON","OR","BEND",3,"Walkup",90141.39,157747.42000000001,123158.69,215527.7,156131.65,273230.39,205974.06,360454.61,255403.7,446956.47,287898.15000000002,503821.76,320025.68,560044.94999999995]
[10,2022,"Region X - Northwest","OREGON","OR","BEND",4,"Elevator",95082.57,152132.10999999999,133115.59,212984.95,171148.62,273837.78999999998,228198.16,365117.06,285247.7,456396.32,323280.71999999997,517249.16,361313.75,578102.01]
[10,2022,"Region X - Northwest","OREGON","OR","EUGENE",1,"Detached/Semi-Detached",116661.15,204157.02,151172.35,264551.61,180521.08,315911.88,214966.31,376191.03,252881.36,442542.38,277207.88,485113.79,300666.11,526165.68000000005]
[10,2022,"Region X - Northwest","OREGON","OR","EUGENE",2,"Row House",92593.79,162039.13,121059.1,211853.42,146408.25,256214.44,178687.88,312703.78999999998,211755.78,370572.62,233212.32,408121.56,253223.67999999999,443141.45]
[10,2022,"Region X - Northwest","OREGON","OR","EUGENE",3,"Walkup",89202.47,156104.31,121817.06,213179.86,154386.93,270177.12,203628.11,356349.18,252452.82,441792.44,284539.90000000002,497944.83,316256.78999999998,553449.38]
[10,2022,"Region X - Northwest","OREGON","OR","EUGENE",4,"Elevator",94500.6,151200.95999999999,132300.84,211681.34,170101.08,272161.73,226801.43,362882.3,283501.78999999998,453602.88,321302.03000000003,514083.26,359102.27,574563.64]
[10,2022,"Region X - Northwest","OREGON","OR","KLAMATH FALLS",1,"Detached/Semi-Detached",110130.05,192727.59,142619.15,249583.52,170231.22,297904.63,202603.68,354556.44,238268.92,416970.62,261149.82,457012.19,283176.49,495558.86]
[10,2022,"Region X - Northwest","OREGON","OR","KLAMATH FALLS",2,"Row House",87979.56,153964.23000000001,114904.3,201082.53,138835.35,242961.86,169214.69,296125.7,200418.84,350732.97,220658.33,386152.08,239512.67,419147.17]
[10,2022,"Region X - Northwest","OREGON","OR","KLAMATH FALLS",3,"Walkup",85186.76,149076.84,116439.3,203768.78,147650.68,258388.68,194823.34,340940.85,241612.72,422822.26,272379.76,476664.58,302806.09000000003,529910.66]
[10,2022,"Region X - Northwest","OREGON","OR","KLAMATH FALLS",4,"Elevator",89508.76,143214.01,125312.26,200499.62,161115.76,257785.23,214821.02,343713.63,268526.27,429642.04,304329.78000000003,486927.65,340133.28,544213.26]
[10,2022,"Region X - Northwest","OREGON","OR","MEDFORD",1,"Detached/Semi-Detached",111794.93,195641.12,144856.93,253499.63,172971.42,302699.98,205964.38,360437.66,242284.27,423997.48,265587.09999999998,464777.43,288054.15000000002,504094.77]
[10,2022,"Region X - Northwest","OREGON","OR","MEDFORD",2,"Row House",88792.49,155386.85999999999,116076.12,203133.21,140368.01,245644.01,171291.19,299759.59000000003,202978.41,355212.22,223538.25,391191.94,242710.95,424744.17]
[10,2022,"Region X - Northwest","OREGON","OR","MEDFORD",3,"Walkup",85586.41,149776.22,116890.27,204557.97,148151.37,259264.9,195412.31,341971.55,242275.22,423981.64,273074.90000000002,477881.08,303520.77,531161.35]
[10,2022,"Region X - Northwest","OREGON","OR","MEDFORD",4,"Elevator",90590.74,144945.19,126827.04,202923.26,163063.32999999999,260901.34,217417.78,347868.45,271772.21999999997,434835.56,308008.52,492813.63,344244.81,550791.71]
[10,2022,"Region X - Northwest","OREGON","OR","PENDLETON",1,"Detached/Semi-Detached",114520.8,200411.4,148434.97,259761.19,177282.81,310244.92,211154.04,369519.58,248424.53,434742.93,272338.34999999998,476592.11,295413.67,516973.92]
[10,2022,"Region X - Northwest","OREGON","OR","PENDLETON",2,"Row House",90666.43,158666.23999999999,118588.2,207529.36,143471.87,251075.77,175196.67,306594.17,207662.9,363410.07,228732.13,400281.23,248391.09,434684.41]
[10,2022,"Region X - Northwest","OREGON","OR","PENDLETON",3,"Walkup",87173.29,152553.26999999999,119003.36,208255.88,150789.09,263880.90000000002,198850.64,347988.63,246499.42,431373.99,277806.64,486161.62,308746.94,540307.14]
[10,2022,"Region X - Northwest","OREGON","OR","PENDLETON",4,"Elevator",92646.96,148235.14000000001,129705.74,207529.19,166764.53,266823.25,222352.7,355764.33,277940.88,444705.41,314999.65999999997,503999.47,352058.45,563293.53]
[10,2022,"Region X - Northwest","OREGON","OR","PORTLAND",1,"Detached/Semi-Detached",116112.31,203196.54,150445.37,263279.40999999997,179639.63,314369.34999999998,213897.51,374320.64000000001,251611.91,440320.84,275809.32,482666.3,299136.46000000002,523488.81]
[10,2022,"Region X - Northwest","OREGON","OR","PORTLAND",2,"Row House",92257.93,161451.38,120598.61,211047.57,145828.69,255200.2,177940.13,311395.23,210850.28,368987.99,232203.1,406355.42,252113.88,441199.3]
[10,2022,"Region X - Northwest","OREGON","OR","PORTLAND",3,"Walkup",88954.15,155669.76000000001,121496.55,212618.97,153994.62,269490.59000000003,203124.69,355468.21,251841.99,440723.48,283861.53999999998,496757.7,315514.19,552149.82999999996]
[10,2022,"Region X - Northwest","OREGON","OR","PORTLAND",4,"Elevator",94108.32,150573.32,131751.65,210802.65,169394.98,271031.96999999997,225859.98,361375.97,282324.96999999997,451719.96,319968.3,511949.29,357611.63,572178.61]
[10,2022,"Region X - Northwest","OREGON","OR","SALEM",1,"Detached/Semi-Detached",113404.77,198458.36,146924.18,257117.31,175424.07,306992.13,208862.15,365508.76,245678.64,429937.63,269299.65000000002,471274.38,292065.65999999997,511114.91]
[10,2022,"Region X - Northwest","OREGON","OR","SALEM",2,"Row House",90189.35,157831.37,117876.88,206284.54,142518.78,249407.87,173867.92,304268.84999999998,206008.84,360515.47,226861.45,397007.54,246302.62,431029.58]
[10,2022,"Region X - Northwest","OREGON","OR","SALEM",3,"Walkup",87021.96,152288.44,118872.9,208027.58,150680.70000000001,263691.21999999997,198765.09,347838.91,246447.77,431283.59,277789.86,486132.26,308774.87,540356.03]
[10,2022,"Region X - Northwest","OREGON","OR","SALEM",4,"Elevator",91957.26,147131.60999999999,128740.16,205984.26,165523.06,264836.90000000002,220697.42,353115.87,275871.77,441394.84,312654.67,500247.49,349437.58,559100.13]
[10,2022,"Region X - Northwest","WASHINGTON","WA","EVERETT",1,"Detached/Semi-Detached",125314.27,219299.98,162406.1,284210.67,193953.36,339418.38,230986.9,404227.07,271743.65000000002,475551.38,297893.90999999997,521314.35,323119.46000000002,565459.06000000006]
[10,2022,"Region X - Northwest","WASHINGTON","WA","EVERETT",2,"Row House",99330.04,173827.57,129894.44,227315.27,157123.57999999999,274966.27,191819.04,335683.32,227342.58,397849.52,250394.28,438189.99,271898.44,475822.27]
[10,2022,"Region X - Northwest","WASHINGTON","WA","EVERETT",3,"Walkup",95592.65,167287.13,130519.09,228408.41,165397.24,289445.17,218131.62,381730.33,270416.37,473228.64,304773.28000000003,533353.23,338730.51,592778.4]
[10,2022,"Region X - Northwest","WASHINGTON","WA","EVERETT",4,"Elevator",101440.93,162305.49,142017.29999999999,227227.68,182593.67,292149.88,243458.23,389533.17,304322.78000000003,486916.46,344899.16,551838.66,385475.53,616760.85]
[10,2022,"Region X - Northwest","WASHINGTON","WA","OLYMPIA",1,"Detached/Semi-Detached",121070.25,211872.93,157045,274828.76,187668.51,328419.90000000002,223670.97,391424.21,263243.95,460676.92,288637.98,505116.47,313192,548085.99]
[10,2022,"Region X - Northwest","WASHINGTON","WA","OLYMPIA",2,"Row House",95086.01,166400.51999999999,124533.35,217933.36,150838.74,263967.78999999998,184503.12,322880.45,218842.89,382975.06,241138.35,421992.12,261970.97,458449.2]
[10,2022,"Region X - Northwest","WASHINGTON","WA","OLYMPIA",3,"Walkup",90843.69,158976.47,123870.56,216773.47,156849.12,274485.96999999997,206734.13,361784.73,256169.51,448296.64,288626.84000000003,505096.97,320684.49,561197.87]
[10,2022,"Region X - Northwest","WASHINGTON","WA","OLYMPIA",4,"Elevator",97543.95,156070.32999999999,136561.54,218498.46,175579.12,280926.59000000003,234105.49,374568.79,292631.86,468210.99,331649.44,530639.12,370667.02,593067.25]
[10,2022,"Region X - Northwest","WASHINGTON","WA","SEATTLE",1,"Detached/Semi-Detached",122661.75,214658.07,159055.41,278346.96999999997,190025.33,332544.32,226414.44,396225.27,266431.33,466254.83,292108.95,511190.67,316914.78999999998,554600.88]
[10,2022,"Region X - Northwest","WASHINGTON","WA","SEATTLE",2,"Row House",96677.52,169185.66,126543.76,221451.57,153195.54999999999,268092.21000000002,187246.58,327681.52,222030.27,388552.97,244609.32,428066.31,265693.77,464964.09]
[10,2022,"Region X - Northwest","WASHINGTON","WA","SEATTLE",3,"Walkup",92624.55,162092.96,126363.75,221136.57,160054.66,280095.65999999997,211008.18,369264.32,261512.07,457646.13,294681.74,515693.05,327451.74,573040.55000000005]
[10,2022,"Region X - Northwest","WASHINGTON","WA","SEATTLE",4,"Elevator",99005.32,158408.51,138607.44,221771.91,178209.57,285135.32,237612.76,380180.42,297015.95,475225.53,336618.08,538588.93000000005,376220.2,601952.34]
[10,2022,"Region X - Northwest","WASHINGTON","WA","SPOKANE",1,"Detached/Semi-Detached",110203.42,192855.98,142846.51999999999,249981.41,170614.6,298575.55,203220.91,355636.59,239096.89,418419.55,262116.13,458703.23,284331.34999999998,497579.87]
[10,2022,"Region X - Northwest","WASHINGTON","WA","SPOKANE",2,"Row House",87200.98,152601.72,114065.71,199614.99,138011.19,241519.58,168547.72,294958.51,199791.03,349634.3,220067.27,385117.73,238988.15,418229.27]
[10,2022,"Region X - Northwest","WASHINGTON","WA","SPOKANE",3,"Walkup",83805.55,146659.72,114397.07,200194.87,144945.82999999999,253655.2,191138.25,334491.94,236932.65,414632.13,267019.98,467284.97,296753.51,519318.64]
[10,2022,"Region X - Northwest","WASHINGTON","WA","SPOKANE",4,"Elevator",89129.37,142607,124781.12,199649.8,160432.87,256692.6,213910.5,342256.8,267388.12,427821,303039.87,484863.8,338691.62,541906.6]
[10,2022,"Region X - Northwest","WASHINGTON","WA","TACOMA",1,"Detached/Semi-Detached",122661.75,214658.07,159055.41,278346.96999999997,190025.33,332544.32,226414.44,396225.27,266431.33,466254.83,292108.95,511190.67,316914.78999999998,554600.88]
[10,2022,"Region X - Northwest","WASHINGTON","WA","TACOMA",2,"Row House",96677.52,169185.66,126543.76,221451.57,153195.54999999999,268092.21000000002,187246.58,327681.52,222030.27,388552.97,244609.32,428066.31,265693.77,464964.09]
[10,2022,"Region X - Northwest","WASHINGTON","WA","TACOMA",3,"Walkup",92624.55,162092.96,126363.75,221136.57,160054.66,280095.65999999997,211008.18,369264.32,261512.07,457646.13,294681.74,515693.05,327451.74,573040.55000000005]
[10,2022,"Region X - Northwest","WASHINGTON","WA","TACOMA",4,"Elevator",99005.32,158408.51,138607.44,221771.91,178209.57,285135.32,237612.76,380180.42,297015.95,475225.53,336618.08,538588.93000000005,376220.2,601952.34]
[10,2022,"Region X - Northwest","WASHINGTON","WA","VANCOUVER",1,"Detached/Semi-Detached",114484.12,200347.21,148321.29,259562.25,177091.13,309909.46999999997,210845.43,368979.51,248010.55,434018.47,271855.2,475746.6,294836.24,515963.42]
[10,2022,"Region X - Northwest","WASHINGTON","WA","VANCOUVER",2,"Row House",91055.71,159347.5,119007.5,208263.13,143883.95000000001,251796.91,175530.15,307177.77,207976.81,363959.41,229027.66,400798.41,248653.35,435143.36]
[10,2022,"Region X - Northwest","WASHINGTON","WA","VANCOUVER",3,"Walkup",87863.9,153761.82,120024.48,210042.83,152141.51,266247.64,200693.19,351213.08,248839.46,435469.05,280486.52,490851.42,311773.23,545603.15]
[10,2022,"Region X - Northwest","WASHINGTON","WA","VANCOUVER",4,"Elevator",92836.65,148538.65,129971.31,207954.11,167105.97,267369.56,222807.97,356492.75,278509.96000000002,445615.94,315644.62,505031.4,352779.28,564446.86]
[10,2022,"Region X - Northwest","WASHINGTON","WA","WENATCHEE",1,"Detached/Semi-Detached",111831.61,195705.31,144970.60999999999,253698.57,173163.1,303035.43,206272.99,360977.73,242698.25,424721.94,266070.25,465622.94,288631.58,505105.27]
[10,2022,"Region X - Northwest","WASHINGTON","WA","WENATCHEE",2,"Row House",88403.199999999997,154705.60000000001,115656.82,202399.44,139955.93,244922.87,170957.71,299175.99,202664.51,354662.88,223242.72,390674.75,242448.69,424285.21]
[10,2022,"Region X - Northwest","WASHINGTON","WA","WENATCHEE",3,"Walkup",84895.81,148567.66,115869.15,202771.01,146798.95000000001,256898.16,193569.77,338747.1,239935.19,419886.58,270395.01,473191.28,300494.48,525865.34]
[10,2022,"Region X - Northwest","WASHINGTON","WA","WENATCHEE",4,"Elevator",90401.05,144641.68,126561.47,202498.35,162721.89000000001,260355.02,216962.51,347140.03,271203.14,433925.03,307363.56,491781.71,343523.98,549638.38]
[10,2022,"Region X - Northwest","WASHINGTON","WA","YAKIMA",1,"Detached/Semi-Detached",112892.61,197562.07,146310.88,256044.04,174734.31,305785.05,208101.97,364178.44,244823.17,428440.55,268384.23,469672.41,291113.44,509448.53]
[10,2022,"Region X - Northwest","WASHINGTON","WA","YAKIMA",2,"Row House",89464.21,156562.35999999999,116997.09,204744.92,141527.14000000001,247672.49,172786.68,302376.7,204789.43,358381.5,225556.69,394724.22,244930.56,428628.47]
[10,2022,"Region X - Northwest","WASHINGTON","WA","YAKIMA",3,"Walkup",86083.04,150645.32999999999,117531.28,205679.74,148935.97,260637.95,196419.14,343733.49,243496.9,426119.57,274431.62,480255.33,305005.98,533760.47]
[10,2022,"Region X - Northwest","WASHINGTON","WA","YAKIMA",4,"Elevator",91375.29,146200.47,127925.41,204680.65,164475.51999999999,263160.84000000003,219300.7,350881.12,274125.87,438601.4,310675.98,497081.58,347226.1,555561.77]
[2,2022,"Region II - Northeast","GUAM","GQ","GUAM",1,"Detached/Semi-Detached",132313.24,231548.17,172034.66,301060.65000000002,205924.04,360367.07,245920.87,430361.52,289742.17,507048.8,317871.93,556275.88,345239.39,604168.93000000005]
[2,2022,"Region II - Northeast","GUAM","GQ","GUAM",2,"Row House",101348.42,177359.74,133291.26,233259.71,162034.82999999999,283560.96000000002,199245.42,348679.49,236830.44,414453.27,261267.7,457218.48,284200.46999999997,497350.82]
[2,2022,"Region II - Northeast","GUAM","GQ","GUAM",3,"Walkup",94869.62,166021.82999999999,128872.28,225526.49,162817.39000000001,284930.44,214232.18,374906.31,265111.15000000002,463944.5,298435.11,522261.44,331282.78999999998,579744.88]
[2,2022,"Region II - Northeast","GUAM","GQ","GUAM",4,"Elevator",105255.79,168409.27,147358.10999999999,235772.98,189460.43,303136.69,252613.9,404182.25,315767.38,505227.81,357869.69,572591.52,399972.01,639955.22]
[2,2022,"Region II - Northeast","NEW JERSEY","NJ","ATLANTIC CITY",1,"Detached/Semi-Detached",141028.99,246800.73,182863.16,320010.53000000003,218461.09,382306.91,260284.59,455498.03,306280.81,535991.42000000004,335794.97,587641.19999999995,364303.35,637530.85]
[2,2022,"Region II - Northeast","NEW JERSEY","NJ","ATLANTIC CITY",2,"Row House",111211.02,194619.28,145554.71,254720.74,176197.42,308345.48,215337.87,376841.28,255328.78,446825.36,281287.2,492252.6,305525.13,534668.97]
[2,2022,"Region II - Northeast","NEW JERSEY","NJ","ATLANTIC CITY",3,"Walkup",106592.14,186536.25,145429.93,254502.38,184212.3,322371.53000000003,242864.57,425012.99,301000.86,526751.5,339185.09,593573.9,376910.67,659593.68000000005]
[2,2022,"Region II - Northeast","NEW JERSEY","NJ","ATLANTIC CITY",4,"Elevator",113860.21,182176.34,159404.29999999999,255046.88,204948.38,327917.42,273264.51,437223.22,341580.64,546529.03,387124.72,619399.56999999995,432668.81,692270.11]
[2,2022,"Region II - Northeast","NEW JERSEY","NJ","CAMDEN",1,"Detached/Semi-Detached",130632.1,228606.17,169222.05,296138.58,202029.13,353550.98,240512.48,420896.85,282891.56,495060.23,310080.94,542641.64,336277.25,588485.18000000005]
[2,2022,"Region II - Northeast","NEW JERSEY","NJ","CAMDEN",2,"Row House",104025.29,182044.26,135931.43,237880,164316.93,287554.62,200406.18,350710.82,237426.67,415496.66,261443.24,457525.66,283828.99,496700.73]
[2,2022,"Region II - Northeast","NEW JERSEY","NJ","CAMDEN",3,"Walkup",100473.82,175829.18,137273.41,240228.47,174023.55,304541.21000000002,229575.91,401757.84,284667.87,498168.77,320884.28000000003,561547.49,356691.44,624210.03]
[2,2022,"Region II - Northeast","NEW JERSEY","NJ","CAMDEN",4,"Elevator",105997.42,169595.88,148396.39000000001,237434.23,190795.36,305272.58,254393.81,407030.11,317992.27,508787.64,360391.24,576625.99,402790.21,644464.34]
[2,2022,"Region II - Northeast","NEW JERSEY","NJ","ELIZABETH",1,"Detached/Semi-Detached",136361.04999999999,238631.84,176712.75,309247.31,211030.73,369303.77,251313.04,439797.82,295648.65999999997,517385.16,324094.96000000002,567166.18000000005,351531.24,615179.68000000005]
[2,2022,"Region II - Northeast","NEW JERSEY","NJ","ELIZABETH",2,"Row House",108148.66,189260.16,141413.21,247473.12,171042.78,299324.87,208786.53,365376.42,247440.19,433020.34,272522.21999999997,476913.89,295918,517856.51]
[2,2022,"Region II - Northeast","NEW JERSEY","NJ","ELIZABETH",3,"Walkup",104126.61,182221.56,142182.74,248819.8,180186.45,315326.28000000003,237644.93,415878.63,294615.23,515576.66,332053,581092.75,369056.83,645849.44999999995]
[2,2022,"Region II - Northeast","NEW JERSEY","NJ","ELIZABETH",4,"Elevator",110415.94,176665.51,154582.32,247331.72,198748.7,317997.92,264998.27,423997.23,331247.83,529996.54,375414.21,600662.75,419580.59,671328.95]
[2,2022,"Region II - Northeast","NEW JERSEY","NJ","HACKENSACK",1,"Detached/Semi-Detached",134360.16,235130.27,174257.72,304951.01,208215.59,364377.28,248128.11,434224.19,292008.08,511014.15,320165.3,560289.28000000003,347380.26,607915.46]
[2,2022,"Region II - Northeast","NEW JERSEY","NJ","HACKENSACK",2,"Row House",105689.03,184955.8,138384.21,242172.36,167577.44,293260.52,204910.11,358592.69,243015.74,425277.54,267753.98,468569.47,290862.74,509009.8]
[2,2022,"Region II - Northeast","NEW JERSEY","NJ","HACKENSACK",3,"Walkup",101099.72,176924.52,137886.66,241301.66,174620.31,305585.55,230181.09,402816.9,285245.73,499180.03,321404.25,562457.43000000005,357121.76,624963.07999999996]
[2,2022,"Region II - Northeast","NEW JERSEY","NJ","HACKENSACK",4,"Elevator",108338.11,173340.98,151673.35999999999,242677.37,195008.6,312013.77,260011.47,416018.35,325014.33,520022.94,368349.58,589359.34,411684.82,658695.73]
[2,2022,"Region II - Northeast","NEW JERSEY","NJ","JERSEY CITY",1,"Detached/Semi-Detached",134360.16,235130.27,174257.72,304951.01,208215.59,364377.28,248128.11,434224.19,292008.08,511014.15,320165.3,560289.28000000003,347380.26,607915.46]
[2,2022,"Region II - Northeast","NEW JERSEY","NJ","JERSEY CITY",2,"Row House",105689.03,184955.8,138384.21,242172.36,167577.44,293260.52,204910.11,358592.69,243015.74,425277.54,267753.98,468569.47,290862.74,509009.8]
[2,2022,"Region II - Northeast","NEW JERSEY","NJ","JERSEY CITY",3,"Walkup",101099.72,176924.52,137886.66,241301.66,174620.31,305585.55,230181.09,402816.9,285245.73,499180.03,321404.25,562457.43000000005,357121.76,624963.07999999996]
[2,2022,"Region II - Northeast","NEW JERSEY","NJ","JERSEY CITY",4,"Elevator",108338.11,173340.98,151673.35999999999,242677.37,195008.6,312013.77,260011.47,416018.35,325014.33,520022.94,368349.58,589359.34,411684.82,658695.73]
[2,2022,"Region II - Northeast","NEW JERSEY","NJ","NEW BRUNSWICK",1,"Detached/Semi-Detached",136952.10999999999,239666.2,177495.65,310617.38,211979.98,370964.96,252464.05,441812.08,297015.76,519777.58,325601.11,569801.93000000005,353178.55,618062.47]
[2,2022,"Region II - Northeast","NEW JERSEY","NJ","NEW BRUNSWICK",2,"Row House",108510.36,189893.13,141909.12,248340.96,171666.93,300417.13,209591.79,366785.63,248415.35,434726.87,273609.08,478815.88,297113.17,519948.06]
[2,2022,"Region II - Northeast","NEW JERSEY","NJ","NEW BRUNSWICK",3,"Walkup",104394.02,182689.54,142527.9,249423.83,180608.93,316065.62,238187.07,416827.37,295273.06,516727.85,332783.53999999998,582371.19999999995,369856.55,647248.97]
[2,2022,"Region II - Northeast","NEW JERSEY","NJ","NEW BRUNSWICK",4,"Elevator",110838.39,177341.43,155173.75,248278.01,199509.11,319214.58,266012.15000000002,425619.44,332515.18,532024.30000000005,376850.54,602960.87,421185.9,673897.45]
[2,2022,"Region II - Northeast","NEW JERSEY","NJ","NEWARK",1,"Detached/Semi-Detached",136603.28,239055.75,177163.79,310036.62,211685.3,370449.28,252259.11,441453.44,296867.20000000001,519517.6,325491.57,569610.25,353156.74,618024.30000000005]
[2,2022,"Region II - Northeast","NEW JERSEY","NJ","NEWARK",2,"Row House",107473.42,188078.49,140716.29999999999,246253.52,170396.94,298194.65000000002,208349.62,364611.83,247090.98,432409.22,272241.67,476422.93,295734.94,517536.15]
[2,2022,"Region II - Northeast","NEW JERSEY","NJ","NEWARK",3,"Walkup",102821.79,179938.14,140239.10999999999,245418.45,177602.3,310804.02,234114.72,409700.77,290123.09000000003,507715.41,326901.93,572078.38,363232.72,635657.25]
[2,2022,"Region II - Northeast","NEW JERSEY","NJ","NEWARK",4,"Elevator",110157.25,176251.61,154220.15,246752.25,198283.06,317252.89,264377.40999999997,423003.86,330471.76,528754.81999999995,374534.66,599255.47,418597.56,669756.11]
[2,2022,"Region II - Northeast","NEW JERSEY","NJ","PATERSON",1,"Detached/Semi-Detached",134830.1,235952.67,174815.1,305926.42,208837.55,365465.71,248806.08,435410.64,292765.90999999997,512340.34,320973.14,561702.99,348214.81,609375.92000000004]
[2,2022,"Region II - Northeast","NEW JERSEY","NJ","PATERSON",2,"Row House",106388.34,186179.6,139228.57,243650,168524.5,294917.88,205933.82,360384.19,244165.5,427289.62,268981.11,470716.93,292149.43,511261.51]
[2,2022,"Region II - Northeast","NEW JERSEY","NJ","PATERSON",3,"Walkup",102019.54,178534.2,139203.63,243606.36,176334.86,308586.01,232488.32000000001,406854.56,288149.62,504261.83,324710.31,568243.04,360833.53,631458.68000000005]
[2,2022,"Region II - Northeast","NEW JERSEY","NJ","PATERSON",4,"Elevator",108889.9,174223.85,152445.87,243913.39,196001.83,313602.93,261335.77,418137.24,326669.71000000002,522671.55,370225.67,592361.09,413781.64,662050.63]
[2,2022,"Region II - Northeast","NEW JERSEY","NJ","TRENTON",1,"Detached/Semi-Detached",133587.41,233777.98,173136.54,302988.95,206775.4,361856.95,246267.54,430968.2,289727.07,507022.37,317611.69,555820.44999999995,344513.82,602899.18000000005]
[2,2022,"Region II - Northeast","NEW JERSEY","NJ","TRENTON",2,"Row House",105833.76,185209.09,138410.98000000001,242219.21,167437.67000000001,293015.92,204432.52,357756.9,242302.48,424029.34,266877.53000000003,467035.67,289804.84999999998,507158.5]
[2,2022,"Region II - Northeast","NEW JERSEY","NJ","TRENTON",3,"Walkup",101810.91,178169.09,138999.22,243248.63,176135.94,308237.90000000002,232286.6,406501.54,287957,503924.75,324536.99,567939.73,360690.1,631207.67000000004]
[2,2022,"Region II - Northeast","NEW JERSEY","NJ","TRENTON",4,"Elevator",108109.68,172975.48,151353.54999999999,242165.68,194597.42,311355.87,259463.22,415141.16,324329.03000000003,518926.45,367572.9,588116.65,410816.77,657306.84]
[2,2022,"Region II - Northeast","NEW JERSEY","NJ","VINELAND",1,"Detached/Semi-Detached",127509.64,223141.87,165313.99,289299.49,197479.15,345588.51,235262.07,411708.62,276821.44,484437.51,303488.15999999997,531104.28,329238.03999999998,576166.56000000006]
[2,2022,"Region II - Northeast","NEW JERSEY","NJ","VINELAND",2,"Row House",100673.47,176178.57,131736.39000000001,230538.68,159441.84,279023.21999999997,194810.02,340917.54,230964.6,404188.06,254431.17,445254.54,276337.64,483590.87]
[2,2022,"Region II - Northeast","NEW JERSEY","NJ","VINELAND",3,"Walkup",96585.91,169025.34,131801.10999999999,230651.95,166966.44,292191.27,220145.26,385254.21,272859.71000000002,477504.5,307486.71000000002,538101.74,341700.93,597976.63]
[2,2022,"Region II - Northeast","NEW JERSEY","NJ","VINELAND",4,"Elevator",103010.03,164816.04,144214.03,230742.46,185418.04,296668.88,247224.06,395558.5,309030.07,494448.13,350234.08,560374.54,391438.09,626300.96]
[2,2022,"Region II - Northeast","NEW YORK","NY","ALBANY",1,"Detached/Semi-Detached",119128.18,208474.32,154472.62,270327.09000000003,184549.54,322961.69,219889.08,384805.9,258752.05,452816.09,283689.21000000002,496456.12,307779.40000000002,538613.94999999995]
[2,2022,"Region II - Northeast","NEW YORK","NY","ALBANY",2,"Row House",93897.59,164320.79,122903.93,215081.88,148787.97,260378.94,181857.24,318250.17,215638.79,377367.88,237567.25,415742.69,258043.98,451576.97]
[2,2022,"Region II - Northeast","NEW YORK","NY","ALBANY",3,"Walkup",89965.04,157438.81,122736.45,214788.8,155460.98000000001,272056.71999999997,204952.83,358667.45,254008.08,444514.15,286226.49,500896.35,318056.81,556599.42000000004]
[2,2022,"Region II - Northeast","NEW YORK","NY","ALBANY",4,"Elevator",96155.9,153849.45000000001,134618.26,215389.23,173080.63,276929,230774.17,369238.67,288467.71000000002,461548.34,326930.07,523088.12,365392.43,584627.9]
[2,2022,"Region II - Northeast","NEW YORK","NY","BINGHAMTON",1,"Detached/Semi-Detached",111626.05,195345.59,144633.24,253108.17,172700.2,302225.34000000003,205635.51,359862.15,241893.67,423313.91999999998,265156.77,464024.34,287583.49,503271.1]
[2,2022,"Region II - Northeast","NEW YORK","NY","BINGHAMTON",2,"Row House",88689.15,155206.01,115934.43,202885.25,140189.68,245331.93,171061.11,299356.95,202699.79,354724.63,223227.71,390648.5,242369.47,424146.57]
[2,2022,"Region II - Northeast","NEW YORK","NY","BINGHAMTON",3,"Walkup",85510.01,149642.51,116791.65,204385.39,148030.66,259053.66,195257.41,341700.48,242087.27,423652.72,272866.17,477515.8,303292.27,530761.48]
[2,2022,"Region II - Northeast","NEW YORK","NY","BINGHAMTON",4,"Elevator",90470.04,144752.06,126658.05,202652.89,162846.07,260553.71,217128.09,347404.95,271410.11,434256.19,307598.13,492157.01,343786.14,550057.84]
[2,2022,"Region II - Northeast","NEW YORK","NY","BRONX",1,"Detached/Semi-Detached",149061.63,260857.84,193372.68,338402.19,231096.04,404418.07,275452.65000000002,482042.14,324201.65999999997,567352.9,355484.4,622097.71,385740.19,675045.33]
[2,2022,"Region II - Northeast","NEW YORK","NY","BRONX",2,"Row House",116949.97,204662.44,153194.35,268090.11,185581.31,324767.28999999998,227048.49,397334.86,269330.23,471327.9,296783.73,519371.52000000002,322440.57,564271]
[2,2022,"Region II - Northeast","NEW YORK","NY","BRONX",3,"Walkup",111640.79,195371.39,152205.81,266360.15999999997,192711.14,337244.49,253984.66,444473.16,314702.53000000003,550729.42000000004,354563.7,620486.48,393930.96,689379.18]
[2,2022,"Region II - Northeast","NEW YORK","NY","BRONX",4,"Elevator",120033.2,192053.12,168046.48,268874.37,216059.76,345695.62,288079.68,460927.49,360099.6,576159.36,408112.88,652980.61,456126.16,729801.86]
[2,2022,"Region II - Northeast","NEW YORK","NY","BROOKLYN",1,"Detached/Semi-Detached",152714.59,267250.53000000003,197950.88,346414.04,236431.63,413755.36,281617.57,492830.74,331334.25,579834.93999999994,363234.18,635659.81999999995,394020.35,689535.61]
[2,2022,"Region II - Northeast","NEW YORK","NY","BROOKLYN",2,"Row House",120832.3,211456.52,158059.53,276604.18,191242.01,334673.52,233559.15,408728.51,276854.77,484495.84,304952.8,533667.4,331172.87,579552.52]
[2,2022,"Region II - Northeast","NEW YORK","NY","BROOKLYN",3,"Walkup",116122.33,203214.07,158509.18,277391.06,200836.77,351464.35,264840.01,463470.02,328291.56,574510.23,369979.6,647464.30000000005,411177.25,719560.19]
[2,2022,"Region II - Northeast","NEW YORK","NY","BROOKLYN",4,"Elevator",123507.72,197612.36,172910.81,276657.31,222313.9,355702.25,296418.53999999998,474269.67,370523.17,592837.07999999996,419926.26,671882.03,469329.35,750926.97]
[2,2022,"Region II - Northeast","NEW YORK","NY","BUFFALO",1,"Detached/Semi-Detached",122432.32000000001,214256.55,158718.96,277758.18,189590.46,331783.31,225849.06,395235.85,265736.09000000003,465038.16,291329.46000000002,509826.56,316037.75,553066.05000000005]
[2,2022,"Region II - Northeast","NEW YORK","NY","BUFFALO",2,"Row House",96742.99,169300.23,126576.29,221508.51,153178.68,268062.69,187125.73,327470.03000000003,221838.95,388218.16,244368.92,427645.61,265398.05,464446.58]
[2,2022,"Region II - Northeast","NEW YORK","NY","BUFFALO",3,"Walkup",92874.34,162530.1,126751.03999999999,221814.32,160579.99,281014.98,211735.83,370537.71,262447.15000000002,459282.51,295760.78000000003,517581.36,328679.27,575188.71]
[2,2022,"Region II - Northeast","NEW YORK","NY","BUFFALO",4,"Elevator",98949.29,158318.85999999999,138529,221646.41,178108.72,284973.95,237478.29,379965.27,296847.86,474956.58,336427.57,538284.13,376007.29,601611.67000000004]
[2,2022,"Region II - Northeast","NEW YORK","NY","ELMIRA",1,"Detached/Semi-Detached",108503.59,189881.28,140725.18,246269.07,168150.21,294262.87,200385.09,350673.91,235823.54,412691.19,258563.98,452486.97,280544.27,490952.47]
[2,2022,"Region II - Northeast","NEW YORK","NY","ELMIRA",2,"Row House",85337.32,149340.31,111739.39,195543.93,135314.59,236800.52,165464.95000000001,289563.65999999997,196237.72,343416.02,216215.64,378377.37,234878.11,411036.7]
[2,2022,"Region II - Northeast","NEW YORK","NY","ELMIRA",3,"Walkup",81622.09,142838.66,111319.35,194808.86,140973.54,246703.7,185826.76,325196.82,230279.1,402988.43,259468.59,454070.03,288301.74,504528.05]
[2,2022,"Region II - Northeast","NEW YORK","NY","ELMIRA",4,"Elevator",87482.64,139972.22,122475.69,195961.11,157468.75,251950,209958.33,335933.33,262447.90999999997,419916.67,297440.96999999997,475905.56,332434.02,531894.43999999994]
[2,2022,"Region II - Northeast","NEW YORK","NY","JAMESTOWN",1,"Detached/Semi-Detached",108094.2,189164.86,140280.57,245490.99,167691.89000000001,293460.82,199943.64,349901.37,235370.35,411898.11,258105.3,451684.28,280116.09000000003,490203.15]
[2,2022,"Region II - Northeast","NEW YORK","NY","JAMESTOWN",2,"Row House",84469.2,147821.09,110720.79,193761.39,134206.06,234860.6,164332.01,287581.01,195000.66,341251.15,214918.37,376107.16,233545.65,408704.89]
[2,2022,"Region II - Northeast","NEW YORK","NY","JAMESTOWN",3,"Walkup",80376.070000000007,140658.12,109516.47,191653.82,138612.95000000001,242572.67,182636.97,319614.69,226252.18,395941.31,254874.75,446030.81,283133.94,495484.4]
[2,2022,"Region II - Northeast","NEW YORK","NY","JAMESTOWN",4,"Elevator",86866.17,138985.88,121612.64,194580.23,156359.10999999999,250174.58,208478.81,333566.09999999998,260598.51,416957.63,295344.98,472551.98,330091.45,528146.32999999996]
[2,2022,"Region II - Northeast","NEW YORK","NY","KINGSTON",1,"Detached/Semi-Detached",125327.07,219322.38,162520.69,284411.21000000002,194173.08,339802.89,231367.59,404893.29,272266.96000000002,476467.18,298511.05,522394.33,323867.93,566768.88]
[2,2022,"Region II - Northeast","NEW YORK","NY","KINGSTON",2,"Row House",98720.27,172760.47,129230.07,226152.63,156460.88,273806.53999999998,191261.29,334707.26,226802.06,396903.61,249873.34,437278.35,271419.67,474984.43]
[2,2022,"Region II - Northeast","NEW YORK","NY","KINGSTON",3,"Walkup",94537.64,165440.87,128962.76,225684.82,163338.42000000001,285842.24,215329.08,376825.88,266859.32,467003.82,300701.26,526227.21,334133.95,584734.42000000004]
[2,2022,"Region II - Northeast","NEW YORK","NY","KINGSTON",4,"Elevator",101126.21,161801.94,141576.70000000001,226522.72,182027.18,291243.5,242702.91,388324.66,303378.64,485405.83,343829.12,550126.6,384279.61,614847.38]
[2,2022,"Region II - Northeast","NEW YORK","NY","NEW YORK",1,"Detached/Semi-Detached",151714.14000000001,265499.74,196723.36,344265.88,235024.06,411292.11,280025.09999999998,490043.92,329513.96000000002,576649.43000000005,361269.35,632221.36,391944.85,685903.48]
[2,2022,"Region II - Northeast","NEW YORK","NY","NEW YORK",2,"Row House",119602.48,209304.34,156545.03,273953.78999999998,189509.33,331641.33,231620.94,405336.64,274642.53000000003,480624.43,302568.67,529495.18000000005,328645.23,575129.15]
[2,2022,"Region II - Northeast","NEW YORK","NY","NEW YORK",3,"Walkup",114608.88,200565.55,156361.13,273631.98,198053.7,346593.97,261108.08,456939.14,323606.8,566311.9,364655.21,638146.62,405209.71,709116.99]
[2,2022,"Region II - Northeast","NEW YORK","NY","NEW YORK",4,"Elevator",122468.8,195950.09,171456.33,274330.13,220443.85,352710.16,293925.13,470280.22,367406.41,587850.27,416393.93,666230.31000000006,465381.46,744610.34]
[2,2022,"Region II - Northeast","NEW YORK","NY","NIAGARA FALLS",1,"Detached/Semi-Detached",115945.16,202904.04,150451.81,263290.65999999997,179835.91,314712.83,214402.14,375203.75,252377.28,441660.25,276747.27,484307.72,300333.8,525584.15]
[2,2022,"Region II - Northeast","NEW YORK","NY","NIAGARA FALLS",2,"Row House",90714.57,158750.5,118883.11,208045.45,144074.32999999999,252130.08,176370.3,308648.03000000003,209264.02,366212.03,230625.31,403594.29,250598.38,438547.17]
[2,2022,"Region II - Northeast","NEW YORK","NY","NIAGARA FALLS",3,"Walkup",86403.32,151205.82,117750.06,206062.6,149049.9,260837.32,196404.72,343708.25,243322.95,425815.16,274116.67,479704.16,304522.3,532914.03]
[2,2022,"Region II - Northeast","NEW YORK","NY","NIAGARA FALLS",4,"Elevator",93233.17,149173.07999999999,130526.44,208842.31,167819.71,268511.53999999998,223759.62,358015.39,279699.52,447519.24,316992.78999999998,507188.47,354286.06,566857.71]
[2,2022,"Region II - Northeast","NEW YORK","NY","PLATTSBURGH",1,"Detached/Semi-Detached",112338.23,196591.9,145641.66,254872.9,173976.74,304459.3,207259.56,362704.23,243870.04,426772.58,267361.23,467882.15,290043.55,507576.22]
[2,2022,"Region II - Northeast","NEW YORK","NY","PLATTSBURGH",2,"Row House",88713.22,155248.14000000001,116081.89,203143.3,140490.91,245859.09,171647.93,300383.88,203500.35,356125.62,224174.3,392305.03,243473.12,426077.96]
[2,2022,"Region II - Northeast","NEW YORK","NY","PLATTSBURGH",3,"Walkup",85125.02,148968.79,116165,203288.75,147161.07,257531.87,194034.45,339560.29,240499.03,420873.31,271021.19,474287.08,301179.96000000002,527064.93000000005]
[2,2022,"Region II - Northeast","NEW YORK","NY","PLATTSBURGH",4,"Elevator",90763.15,145221.03,127068.4,203309.45,163373.66,261397.86,217831.55,348530.48,272289.44,435663.1,308594.69,493751.52,344899.95,551839.93000000005]
[2,2022,"Region II - Northeast","NEW YORK","NY","POUGHKEEPSIE",1,"Detached/Semi-Detached",129101.15,225927.01,167324.4,292817.7,199835.96,349712.93,238005.54,416509.69,280008.82,490015.43,306959.13,537178.47,332960.83,582681.44999999995]
[2,2022,"Region II - Northeast","NEW YORK","NY","POUGHKEEPSIE",2,"Row House",102264.98,178963.71,133746.79,234056.89,161798.65,283147.64,197553.49,345718.61,234151.98,409765.97,257902.13,451328.74,280060.43,490105.76]
[2,2022,"Region II - Northeast","NEW YORK","NY","POUGHKEEPSIE",3,"Walkup",98366.76,172141.84,134294.31,235015.04000000001,170171.98,297800.96000000002,224419.31,392733.8,278202.28000000003,486853.98,313541.61,548697.81999999995,348468.18,609819.31000000006]
[2,2022,"Region II - Northeast","NEW YORK","NY","POUGHKEEPSIE",4,"Elevator",104471.39,167154.22,146259.94,234015.91,188048.5,300877.59999999998,250731.33,401170.14,313414.15999999997,501462.67,355202.72,568324.36,396991.27,635186.05000000005]
[2,2022,"Region II - Northeast","NEW YORK","NY","QUEENS",1,"Detached/Semi-Detached",148470.56,259823.49,192589.78,337032.12,230146.79,402756.88,274301.64,480027.87,322834.56,564960.48,353978.26,619461.94999999995,384092.88,672162.54]
[2,2022,"Region II - Northeast","NEW YORK","NY","QUEENS",2,"Row House",116588.27,204029.48,152698.44,267222.27,184957.16,323675.03000000003,226243.22,395925.64,268355.07,469621.37,295696.87,517469.52,321245.40000000002,562179.44999999995]
[2,2022,"Region II - Northeast","NEW YORK","NY","QUEENS",3,"Walkup",111373.38,194903.41,151860.64000000001,265756.13,192288.66,336505.15,253442.53,443524.42,314044.7,549578.23,353833.16,619208.04,393131.23,687979.66]
[2,2022,"Region II - Northeast","NEW YORK","NY","QUEENS",4,"Elevator",119610.75,191377.2,167455.04999999999,267928.08,215299.35,344478.96,287065.8,459305.28,358832.25,574131.61,406676.55,650682.49,454520.85,727233.37]
[2,2022,"Region II - Northeast","NEW YORK","NY","ROCHESTER",1,"Detached/Semi-Detached",118658.24000000001,207651.92,153915.25,269351.69,183927.58,321873.27,219211.11,383619.45,257994.23,451489.9,282881.38,495042.42,306944.84999999998,537153.48]
[2,2022,"Region II - Northeast","NEW YORK","NY","ROCHESTER",2,"Row House",93198.28,163096.99,122059.57,213604.25,147840.9,258721.58,180833.53,316458.68,214489.03,375355.8,236340.13,413595.22,256757.29,449325.25]
[2,2022,"Region II - Northeast","NEW YORK","NY","ROCHESTER",3,"Walkup",89045.22,155829.13,121419.48,212484.1,153746.43,269056.26,202645.6,354629.79,251104.2,439432.35,282920.42,495110.74,314345.03999999998,550103.81999999995]
[2,2022,"Region II - Northeast","NEW YORK","NY","ROCHESTER",4,"Elevator",95604.11,152966.57999999999,133845.75,214153.21,172087.4,275339.84000000003,229449.87,367119.79,286812.33,458899.74,325053.98,520086.37,363295.62,581273]
[2,2022,"Region II - Northeast","NEW YORK","NY","SCHENECTADY",1,"Detached/Semi-Detached",119658.69,209402.7,155142.76,271499.83,185335.14,324336.5,220803.57,386406.25,259814.51,454675.4,284846.2,498480.85,309020.33,540785.57999999996]
[2,2022,"Region II - Northeast","NEW YORK","NY","SCHENECTADY",2,"Row House",94428.09,165249.16,123574.07,216254.62,149573.57,261753.75,182771.73,319850.53000000003,216701.25,379227.18,238724.24,417767.42,259284.91,453748.6]
[2,2022,"Region II - Northeast","NEW YORK","NY","SCHENECTADY",3,"Walkup",90558.65,158477.65,123567.52,216243.16,156529.49,273926.61,206377.51,361160.64,255788.94,447630.64,288244.78999999998,504428.38,320312.56,560546.98]
[2,2022,"Region II - Northeast","NEW YORK","NY","SCHENECTADY",4,"Elevator",96643.02,154628.84,135300.23000000001,216480.38,173957.44,278331.90999999997,231943.26,371109.22,289929.07,463886.52,328586.28000000003,525738.06000000006,367243.49,587589.6]
[2,2022,"Region II - Northeast","NEW YORK","NY","STATEN ISLAND",1,"Detached/Semi-Detached",141559.49,247729.11,183533.3,321183.27,219246.7,383681.72,261199.08,457098.39,307343.27,537850.73,336951.96,589665.93000000005,365544.28,639702.48]
[2,2022,"Region II - Northeast","NEW YORK","NY","STATEN ISLAND",2,"Row House",111741.52,195547.66,146224.85,255893.48,176983.02,309720.28999999998,216252.36,378441.63,256391.24,448684.66,282444.19,494277.33,306766.06,536840.6]
[2,2022,"Region II - Northeast","NEW YORK","NY","STATEN ISLAND",3,"Walkup",107185.76,187575.08,146261,255956.75,185280.82,324241.43,244289.25,427506.19,302781.71000000002,529868,341203.39,597105.93000000005,379166.42,663541.24]
[2,2022,"Region II - Northeast","NEW YORK","NY","STATEN ISLAND",4,"Elevator",114347.33,182955.74,160086.26999999999,256138.03,205825.2,329320.33,274433.59999999998,439093.77,343042,548867.21,388780.94,622049.51,434519.87,695231.8]
[2,2022,"Region II - Northeast","NEW YORK","NY","SYRACUSE",1,"Detached/Semi-Detached",116945.61,204654.82,151679.32,265438.81,181243.47,317176.08,215994.61,377990.56,254197.57,444845.75,278712.09999999998,487746.17,302409.28999999998,529216.27]
[2,2022,"Region II - Northeast","NEW YORK","NY","SYRACUSE",2,"Row House",91944.39,160902.68,120397.62,210695.83,145807,255162.26,178308.51,312039.89,211476.25,370083.43,233009.43,407766.5,253126.02,442970.53]
[2,2022,"Region II - Northeast","NEW YORK","NY","SYRACUSE",3,"Walkup",87916.76,153854.34,119898.1,209821.67,151832.95999999999,265707.69,200136.64,350239.12,248007.7,434013.47,279441.03999999998,489021.82,310489.84000000003,543357.21]
[2,2022,"Region II - Northeast","NEW YORK","NY","SYRACUSE",4,"Elevator",94272.09,150835.35,131980.93,211169.49,169689.76,271503.62,226253.02,362004.83,282816.27,452506.04,320525.11,512840.18,358233.94,573174.31999999995]
[2,2022,"Region II - Northeast","NEW YORK","NY","UTICA",1,"Detached/Semi-Detached",114641.92,200623.35999999999,148660.49,260155.85,177610.1,310817.68,211627.08,370347.39,249033.8,435809.15,273036.65000000002,477814.15,296226.40999999997,518396.22]
[2,2022,"Region II - Northeast","NEW YORK","NY","UTICA",2,"Row House",90328.8,158075.41,118239.75,206919.56,143148.95000000001,250510.67,174978.21,306211.88,207488.29,363104.51,228591.86,400035.75,248299.56,434524.23]
[2,2022,"Region II - Northeast","NEW YORK","NY","UTICA",3,"Walkup",86520.89,151411.56,118031.55,206555.21,149497.01,261619.77,197085.54,344899.7,244253.36,427443.38,275231.11,481654.44,305834.89,535211.06000000006]
[2,2022,"Region II - Northeast","NEW YORK","NY","UTICA",4,"Elevator",92517.62,148028.19,129524.66,207239.46,166531.71,266450.74,222042.28,355267.65,277552.84999999998,444084.56,314559.89,503295.83,351566.94,562507.11]
[2,2022,"Region II - Northeast","NEW YORK","NY","WATERTOWN",1,"Detached/Semi-Detached",108503.59,189881.28,140725.18,246269.07,168150.21,294262.87,200385.09,350673.91,235823.54,412691.19,258563.98,452486.97,280544.27,490952.47]
[2,2022,"Region II - Northeast","NEW YORK","NY","WATERTOWN",2,"Row House",85337.32,149340.31,111739.39,195543.93,135314.59,236800.52,165464.95000000001,289563.65999999997,196237.72,343416.02,216215.64,378377.37,234878.11,411036.7]
[2,2022,"Region II - Northeast","NEW YORK","NY","WATERTOWN",3,"Walkup",81622.09,142838.66,111319.35,194808.86,140973.54,246703.7,185826.76,325196.82,230279.1,402988.43,259468.59,454070.03,288301.74,504528.05]
[2,2022,"Region II - Northeast","NEW YORK","NY","WATERTOWN",4,"Elevator",87482.64,139972.22,122475.69,195961.11,157468.75,251950,209958.33,335933.33,262447.90999999997,419916.67,297440.96999999997,475905.56,332434.02,531894.43999999994]
[2,2022,"Region II - Northeast","NEW YORK","NY","YONKERS",1,"Detached/Semi-Detached",144817.60000000001,253430.8,188011.59,329020.28000000003,224811.19,393419.58,268136.73,469239.27,315701.96000000002,552478.43000000005,346228.47999999998,605899.82999999996,375812.72,657672.26]
[2,2022,"Region II - Northeast","NEW YORK","NY","YONKERS",2,"Row House",112705.94,197235.39,147833.25,258708.2,179296.46,313768.81,219732.57,384531.99,260830.54,456453.44,287527.8,503173.65,312513.09999999998,546897.93000000005]
[2,2022,"Region II - Northeast","NEW YORK","NY","YONKERS",3,"Walkup",106891.84,187060.72,145557.26999999999,254725.23,184163.02,322285.28999999998,242587.18,424527.56,300455.67,525797.42000000004,338417.27,592230.22,375884.94,657798.65]
[2,2022,"Region II - Northeast","NEW YORK","NY","YONKERS",4,"Elevator",116136.22,185817.96,162590.71,260145.15,209045.2,334472.33,278726.94,445963.11,348408.67,557453.89,394863.16,631781.06999999995,441317.65,706108.26]
[2,2022,"Region II - Northeast","PUERTO RICO","PR","SAN JUAN",1,"Detached/Semi-Detached",114474.78,200330.86,148666.92000000001,260167.11,177806.38,311161.17,212131.72,371230.5,249799.18,437148.56,273974.62,479455.58,297423.76,520491.59]
[2,2022,"Region II - Northeast","PUERTO RICO","PR","SAN JUAN",2,"Row House",88785.45,155374.53,116524.25,203917.45,141394.6,247440.55,173408.39,303464.68,205902.04,360328.57,227014.07,397274.63,246784.07,431872.12]
[2,2022,"Region II - Northeast","PUERTO RICO","PR","SAN JUAN",3,"Walkup",83970.07,146947.62,114285.05,199998.84,144552.29,252966.51,190365.57,333139.75,235734.32,412535.06,265486.24,464600.91,294843.02,515975.28]
[2,2022,"Region II - Northeast","PUERTO RICO","PR","SAN JUAN",4,"Elevator",91642.47,146627.95000000001,128299.46,205279.13,164956.44,263930.31,219941.92,351907.08,274927.40000000002,439883.85,311584.39,498535.03,348241.38,557186.21]
[2,2022,"Region II - Northeast","VIRGIN ISLANDS","VI","ST. CROIX",1,"Detached/Semi-Detached",145696.93,254969.63,189013.58,330773.77,225891.47,395310.07,269256.15999999997,471198.27,316912.98,554597.71,347495,608116.25,377075.47,659882.06999999995]
[2,2022,"Region II - Northeast","VIRGIN ISLANDS","VI","ST. CROIX",2,"Row House",114273.38,199978.41,149696.21,261968.37,181352.06,317366.09999999998,221889.23,388306.15,263217.37,460630.4,290052.19,507591.34,315132.26,551481.46]
[2,2022,"Region II - Northeast","VIRGIN ISLANDS","VI","ST. CROIX",3,"Walkup",109057.69,190850.95,148677.13,260184.97,188238.17,329416.78999999998,248084.2,434147.36,307386.49,537926.36,346317.18,606055.06000000006,384764.53,673337.93]
[2,2022,"Region II - Northeast","VIRGIN ISLANDS","VI","ST. CROIX",4,"Elevator",117304.49,187687.18,164226.28,262762.05,211148.08,337836.93,281530.77,450449.24,351913.46,563061.55000000005,398835.26,638136.42000000004,445757.05,713211.29]
[2,2022,"Region II - Northeast","VIRGIN ISLANDS","VI","ST. JOHN",1,"Detached/Semi-Detached",155153.93,271519.38,201539.94,352694.9,241079.51,421889.13,287672.31,503426.55,338786.58,592876.51,371593.35,650288.36,403432.44,706006.78]
[2,2022,"Region II - Northeast","VIRGIN ISLANDS","VI","ST. JOHN",2,"Row House",120060.47,210105.83,157630.76,275853.83,191338.41,334842.21999999997,234773.48,410853.59,278819.95,487934.91,307441.90000000002,538023.31999999995,334255,584946.25]
[2,2022,"Region II - Northeast","VIRGIN ISLANDS","VI","ST. JOHN",3,"Walkup",113336.37,198338.64,154199.70000000001,269849.48,194997.81,341246.17,256758.38,449327.16,317911.69,556345.44999999995,358005.83,626510.21,397560.19,695730.33]
[2,2022,"Region II - Northeast","VIRGIN ISLANDS","VI","ST. JOHN",4,"Elevator",124063.69,198501.9,173689.16,277902.65999999997,223314.64,357303.42,297752.84999999998,476404.56,372191.06,595505.71,421816.54,674906.47,471442.01,754307.23]
[2,2022,"Region II - Northeast","VIRGIN ISLANDS","VI","ST. THOMAS",1,"Detached/Semi-Detached",146879.06,257038.35,190579.38,333513.90999999997,227789.97,398632.45,271558.17,475226.8,319647.18,559382.56000000006,350507.29,613387.76,380370.09,665647.65]
[2,2022,"Region II - Northeast","VIRGIN ISLANDS","VI","ST. THOMAS",2,"Row House",114996.76,201244.34,150688.03,263704.06,182600.35,319550.61,223499.76,391124.58,265167.69,464043.46,292225.90000000002,511395.33,317522.59999999998,555664.56000000006]
[2,2022,"Region II - Northeast","VIRGIN ISLANDS","VI","ST. THOMAS",3,"Walkup",109592.52,191786.91,149367.45000000001,261393.03,189083.12,330895.46000000002,249168.48,436044.83,308702.14,540228.74,347778.26,608611.94999999995,386363.99,676136.97]
[2,2022,"Region II - Northeast","VIRGIN ISLANDS","VI","ST. THOMAS",4,"Elevator",118149.39,189039.02,165409.14000000001,264654.63,212668.9,340270.24,283558.53000000003,453693.65,354448.16,567117.06000000006,401707.91,642732.67000000004,448967.67,718348.28]
[3,2022,"Region III -","DELAWARE","DE","DOVER",1,"Detached/Semi-Detached",117946.06,206405.6,152906.82999999999,267586.95,182651.04,319639.31,217587.07,380777.36,256017.85,448031.24,280676.92,491184.61,304484.78000000003,532848.36]
[3,2022,"Region III -","DELAWARE","DE","DOVER",2,"Row House",93174.21,163054.85999999999,121912.11,213346.2,147539.67000000001,258194.43,180246.71,315431.74,213688.47,373954.82,235393.54,411938.69,255653.64,447393.87]
[3,2022,"Region III -","DELAWARE","DE","DOVER",3,"Walkup",89430.2,156502.85,122046.13,213580.73,154616.03,270578.03999999998,203868.56,356769.97,252692.43,442211.76,284765.40999999997,498339.46,316457.36,553800.37]
[3,2022,"Region III -","DELAWARE","DE","DOVER",4,"Elevator",95311,152497.60999999999,133435.41,213496.65,171559.81,274495.69,228746.41,365994.26,285933.01,457492.82,324057.40999999997,518491.87,362181.81,579490.91]
[3,2022,"Region III -","DELAWARE","DE","WILMINGTON",1,"Detached/Semi-Detached",119719.24,209508.68,155255.51999999999,271697.15999999997,185498.79,324622.88,221040.09,386820.16,260119.15,455208.51,285195.36,499091.88,309426.71000000002,541496.74]
[3,2022,"Region III -","DELAWARE","DE","WILMINGTON",2,"Row House",94259.28,164953.75,123399.84,215949.72,149412.10999999999,261471.2,182662.51,319659.39,216613.95,379074.41,238654.11,417644.69,259239.15,453668.51]
[3,2022,"Region III -","DELAWARE","DE","WILMINGTON",3,"Walkup",90232.45,157906.79,123081.62,215392.83,155883.46,272796.05,205494.96,359616.18,254665.91,445665.34,286957.03000000003,502174.8,318856.53999999998,557998.94999999995]
[3,2022,"Region III -","DELAWARE","DE","WILMINGTON",4,"Elevator",96578.35,154525.37,135209.69,216335.51,173841.03,278145.65999999997,231788.05,370860.88,289735.06,463576.1,328366.40000000002,525386.25,366997.74,587196.39]
[3,2022,"Region III -","DISTRICT OF COLUMBIA","DC","WASHINGTON",1,"Detached/Semi-Detached",110746.72,193806.76,143631.25,251354.69,171619.92,300334.87,204516.09,357903.16,240682.66,421194.65,263890.25,461807.94,286320.75,501061.31]
[3,2022,"Region III -","DISTRICT OF COLUMBIA","DC","WASHINGTON",2,"Row House",87121.71,152463,114071.48,199625.08,138134.09,241734.65,168904.46,295582.8,200312.95999999999,350547.69,220703.33,386230.82,239750.32,419563.05]
[3,2022,"Region III -","DISTRICT OF COLUMBIA","DC","WASHINGTON",3,"Walkup",83344.160000000003,145852.29,113671.8,198925.65,143955.51999999999,251922.17,189760.39,332080.69,235156.46,411523.8,264966.27,463690.97,294412.7,515222.22]
[3,2022,"Region III -","DISTRICT OF COLUMBIA","DC","WASHINGTON",4,"Elevator",89301.78,142882.85,125022.49,200035.99,160743.20000000001,257189.13,214324.27,342918.84,267905.34000000003,428648.55,303626.05,485801.68,339346.76,542954.81999999995]
[3,2022,"Region III -","MARYLAND","MD","BALTIMORE",1,"Detached/Semi-Detached",107260.91,187706.59,139046.63,243331.6,166088.06,290654.11,197846.55,346231.47,232784.7,407373.23,255202.54,446604.44,276843.27,484475.72]
[3,2022,"Region III -","MARYLAND","MD","BALTIMORE",2,"Row House",84782.74,148369.79999999999,110921.79,194113.14,134227.75,234898.56,163963.64000000001,286936.37,194374.7,340155.73,214112.06,374696.1,232533.53,406933.68]
[3,2022,"Region III -","MARYLAND","MD","BALTIMORE",3,"Walkup",81413.460000000006,142473.54999999999,111114.93,194451.13,140774.62,246355.59,185625.03,324843.81,230086.48,402651.34,259295.27,453766.72,288158.31,504277.04]
[3,2022,"Region III -","MARYLAND","MD","BALTIMORE",4,"Elevator",86702.41,138723.85999999999,121383.37,194213.4,156064.34,249702.94,208085.78,332937.26,260107.23,416171.57,294788.19,471661.12,329469.15999999997,527150.66]
[3,2022,"Region III -","MARYLAND","MD","CUMBERLAND",1,"Detached/Semi-Detached",108215.32,189376.81,140506.09,245885.66,168019.19,294033.58,200416.68,350729.19,235979.63,412964.34,258803.61,452906.33,280928.84000000003,491625.47]
[3,2022,"Region III -","MARYLAND","MD","CUMBERLAND",2,"Row House",84131.58,147230.26,110372.34,193151.59,133883.14000000001,234295.5,164113.56,287198.73,194826.06,340945.6,214778.11,375861.69,233454.13,408544.72]
[3,2022,"Region III -","MARYLAND","MD","CUMBERLAND",3,"Walkup",79723.67,139516.42000000001,108544.66,189953.15,137320.88,240311.55,180871.87,316525.78000000003,224006.11,392010.7,252299.23,441523.65,280221.90000000002,490388.32]
[3,2022,"Region III -","MARYLAND","MD","CUMBERLAND",4,"Elevator",86736.83,138778.93,121431.56,194290.5,156126.29,249802.07,208168.39,333069.42,260210.48,416336.78,294905.21999999997,471848.35,329599.95,527359.92000000004]
[3,2022,"Region III -","MARYLAND","MD","HAGERSTOWN",1,"Detached/Semi-Detached",107503.14,188130.5,139497.67000000001,244120.92,166742.64000000001,291799.63,198792.63,347887.1,234003.25,409505.69,256599.16,449048.52,278468.78000000003,487320.36]
[3,2022,"Region III -","MARYLAND","MD","HAGERSTOWN",2,"Row House",84107.5,147188.13,110224.88,192893.55,133581.91,233768.35,163526.74,286171.8,194025.5,339544.62,213831.52,374205.16,232350.48,406613.34]
[3,2022,"Region III -","MARYLAND","MD","HAGERSTOWN",3,"Walkup",80108.649999999994,140190.14000000001,109171.31,191049.78,138190.48000000001,241833.33,182094.83,318665.96000000002,225594.35,394790.11,254144.21,444752.37,282334.21000000002,494084.87]
[3,2022,"Region III -","MARYLAND","MD","HAGERSTOWN",4,"Elevator",86443.72,138309.96,121021.21,193633.94,155598.70000000001,248957.92,207464.93,331943.89,259331.16,414929.87,293908.65000000002,470253.85,328486.14,525577.82999999996]
[3,2022,"Region III -","MARYLAND","MD","SILVER SPRING",1,"Detached/Semi-Detached",105790.51,185133.4,137261.74,240208.05,164058.54,287102.44,195576.12,342258.21,230206.59,402861.54,252429.87,441752.28,273933.21999999997,479383.14]
[3,2022,"Region III -","MARYLAND","MD","SILVER SPRING",2,"Row House",82853.61,144993.82999999999,108562.93,189985.13,131548.01,230209.03,161001.72,281753.01,191012.72,334272.25,210500.82,368376.43,228719.21,400258.61]
[3,2022,"Region III -","MARYLAND","MD","SILVER SPRING",3,"Walkup",78980.2,138215.35,107649.92,188387.36,136277.01,238484.76,179585.88,314275.28999999998,222497.85,389371.23,250664.83,438663.45,278479.01,487338.26]
[3,2022,"Region III -","MARYLAND","MD","SILVER SPRING",4,"Elevator",85111.7,136178.72,119156.38,190650.21,153201.06,245121.7,204268.08,326828.94,255335.1,408536.17,289379.78000000003,463007.66,323424.46000000002,517479.15]
[3,2022,"Region III -","PENNSYLVANIA","PA","ALLENTOWN",1,"Detached/Semi-Detached",121431.87,212505.77,157491.45000000001,275610.03999999998,188182.9,329320.07,224256.6,392449.05,263915.81,461852.66,289364.64,506388.12,313962.26,549433.96]
[3,2022,"Region III -","PENNSYLVANIA","PA","ALLENTOWN",2,"Row House",95513.17,167148.04999999999,125061.79,218858.14,151446.01,265030.52,185187.53,324078.17,219626.73,384346.77,241984.81,423473.41,262870.42,460023.24]
[3,2022,"Region III -","PENNSYLVANIA","PA","ALLENTOWN",3,"Walkup",91360.91,159881.59,124603,218055.25,157796.93,276144.62,208003.92,364006.85,257762.41,451084.22,290436.40999999997,508263.72,322711.75,564745.56000000006]
[3,2022,"Region III -","PENNSYLVANIA","PA","ALLENTOWN",4,"Elevator",97910.37,156656.6,137074.51999999999,219319.24,176238.67,281981.88,234984.9,375975.84,293731.12,469969.8,332895.27,532632.43999999994,372059.42,595295.07999999996]
[3,2022,"Region III -","PENNSYLVANIA","PA","ALTOONA",1,"Detached/Semi-Detached",111701.14,195477,145090.72,253908.76,173551.06,303714.36,207086.22,362400.89,243877.6,426785.79,267491.34999999998,468109.86,290406.34000000003,508211.1]
[3,2022,"Region III -","PENNSYLVANIA","PA","ALTOONA",2,"Row House",86470.55,151323.46,113522.03,198663.55,137789.49,241131.61,169054.38,295845.17,200764.33,351337.58,221369.39,387396.43,240670.92,421174.12]
[3,2022,"Region III -","PENNSYLVANIA","PA","ALTOONA",3,"Walkup",81654.37,142895.16,111101.53,194427.68,140501.79,245878.13,185007.24,323762.67,229076.1,400883.17,257970.24,451447.92,286476.3,501333.52]
[3,2022,"Region III -","PENNSYLVANIA","PA","ALTOONA",4,"Elevator",89336.2,142937.93,125070.68,200113.1,160805.16,257288.27,214406.89,343051.02,268008.61,428813.78,303743.09000000003,485988.95,339477.57,543164.12]
[3,2022,"Region III -","PENNSYLVANIA","PA","ERIE",1,"Detached/Semi-Detached",113641.48,198872.58,147432.98000000001,258007.72,176202.55,308354.46000000002,210034.63,367560.6,247213.53,432623.67,271071.84000000003,474375.73,294150.94,514764.15]
[3,2022,"Region III -","PENNSYLVANIA","PA","ERIE",2,"Row House",89098.99,155923.24,116725.25,204269.19,141416.29,247478.5,173040.02,302820.03000000003,205276.08,359233.14,226207.75,395863.57,245771.94,430100.9]
[3,2022,"Region III -","PENNSYLVANIA","PA","ERIE",3,"Walkup",85007.45,148763.04,115883.51,202796.14,146713.95000000001,256749.42,193353.63,338368.85,239568.62,419245.08,269906.74,472336.8,299867.37,524767.9]
[3,2022,"Region III -","PENNSYLVANIA","PA","ERIE",4,"Elevator",91478.7,146365.93,128070.19,204912.3,164661.67000000001,263458.67,219548.89,351278.23,274436.11,439097.78,311027.59000000003,497644.16,347619.07,556190.53]
[3,2022,"Region III -","PENNSYLVANIA","PA","HARRISBURG",1,"Detached/Semi-Detached",114641.92,200623.35999999999,148660.49,260155.85,177610.1,310817.68,211627.08,370347.39,249033.8,435809.15,273036.65000000002,477814.15,296226.40999999997,518396.22]
[3,2022,"Region III -","PENNSYLVANIA","PA","HARRISBURG",2,"Row House",90328.8,158075.41,118239.75,206919.56,143148.95000000001,250510.67,174978.21,306211.88,207488.29,363104.51,228591.86,400035.75,248299.56,434524.23]
[3,2022,"Region III -","PENNSYLVANIA","PA","HARRISBURG",3,"Walkup",86520.89,151411.56,118031.55,206555.21,149497.01,261619.77,197085.54,344899.7,244253.36,427443.38,275231.11,481654.44,305834.89,535211.06000000006]
[3,2022,"Region III -","PENNSYLVANIA","PA","HARRISBURG",4,"Elevator",92517.62,148028.19,129524.66,207239.46,166531.71,266450.74,222042.28,355267.65,277552.84999999998,444084.56,314559.89,503295.83,351566.94,562507.11]
[3,2022,"Region III -","PENNSYLVANIA","PA","JOHNSTOWN",1,"Detached/Semi-Detached",110988.96,194230.68,144082.29999999999,252144.02,172274.52,301480.40999999997,205462.18,359558.81,241901.22,423327.13,265286.89,464252.06,287946.28000000003,503905.98]
[3,2022,"Region III -","PENNSYLVANIA","PA","JOHNSTOWN",2,"Row House",86446.48,151281.32999999999,113374.57,198405.5,137488.26,240604.45,168467.57,294818.24,199963.77,349936.6,220422.8,385739.9,239567.28,419242.73]
[3,2022,"Region III -","PENNSYLVANIA","PA","JOHNSTOWN",3,"Walkup",82039.360000000001,143568.88,111728.18,195524.31,141371.38,247399.92,186230.2,325902.84999999998,230664.33,403662.59,259815.22,454676.64,288588.61,505030.07]
[3,2022,"Region III -","PENNSYLVANIA","PA","JOHNSTOWN",4,"Elevator",89043.1,142468.96,124660.33,199456.54,160277.57,256444.12,213703.43,341925.49,267129.28999999998,427406.87,302746.53000000003,484394.45,338363.76,541382.03]
[3,2022,"Region III -","PENNSYLVANIA","PA","LANCASTER",1,"Detached/Semi-Detached",111398.34,194947.1,144526.91,252922.09,172732.82,302282.44,205903.62,360331.33,242354.39,424120.19,265745.56,465054.71999999997,288374.44,504655.27]
[3,2022,"Region III -","PENNSYLVANIA","PA","LANCASTER",2,"Row House",87314.6,152800.54,114393.16,200188.03,138596.78,242544.36,169600.5,296800.87,201200.83,352101.44,221720.05,388010.09,240899.72,421574.52]
[3,2022,"Region III -","PENNSYLVANIA","PA","LANCASTER",3,"Walkup",83285.38,145749.41,113531.05,198679.34,143731.97,251530.94,189419.98,331484.96999999997,234691.25,410709.69,264409.05,462715.84,293756.40999999997,514073.71]
[3,2022,"Region III -","PENNSYLVANIA","PA","LANCASTER",4,"Elevator",89659.56,143455.29,125523.38,200837.41,161387.20000000001,258219.53,215182.94,344292.71,268978.67,430365.88,304842.49,487748,340706.32,545130.12]
[3,2022,"Region III -","PENNSYLVANIA","PA","NORRISTOWN",1,"Detached/Semi-Detached",126281.49,220992.61,163980.16,286965.27,196104.22,343182.38,233937.72,409391.02,275461.89,482058.31,302112.14,528696.24,327953.52,573918.65]
[3,2022,"Region III -","PENNSYLVANIA","PA","NORRISTOWN",2,"Row House",98069.1,171620.93,128680.62,225191.08,156116.28,273203.48,191411.21,334969.62,227253.42,397693.49,250539.4,438443.95,272340.28000000003,476595.48]
[3,2022,"Region III -","PENNSYLVANIA","PA","NORRISTOWN",3,"Walkup",92847.85,162483.73000000001,126392.48,221186.84,159884.68,279798.19,210575.91,368507.84,260778.95,456363.17,293705.21999999997,513984.13,326197.53999999998,570845.69999999995]
[3,2022,"Region III -","PENNSYLVANIA","PA","NORRISTOWN",4,"Elevator",101160.63,161857.01,141624.89000000001,226599.82,182089.14,291342.63,242785.52,388456.84,303481.90000000002,485571.04,343946.15,550313.85,384410.4,615056.66]
[3,2022,"Region III -","PENNSYLVANIA","PA","PHILADELPHIA",1,"Detached/Semi-Detached",134708.98000000001,235740.71,174589.57,305531.75,208510.25,364892.95,248333.04,434582.82,292156.63,511274.1,320274.82,560480.93999999994,347402.06,607953.6]
[3,2022,"Region III -","PENNSYLVANIA","PA","PHILADELPHIA",2,"Row House",106725.96,186770.43,139577.01999999999,244259.79,168847.42,295482.98,206152.27,360766.47,244340.1,427595.17,269121.37,470962.4,292240.96000000002,511421.67]
[3,2022,"Region III -","PENNSYLVANIA","PA","PHILADELPHIA",3,"Walkup",102671.94,179675.9,140175.44,245307.03,177626.93,310847.13,234253.41,409943.47,290395.68,508192.44,327285.83,572750.21,363745.57,636554.75]
[3,2022,"Region III -","PENNSYLVANIA","PA","PHILADELPHIA",4,"Elevator",109019.25,174430.8,152626.95000000001,244203.12,196234.64,313975.44,261646.19,418633.91,327057.74,523292.39,370665.44,593064.71,414273.14,662837.03]
[3,2022,"Region III -","PENNSYLVANIA","PA","PITTSBURGH",1,"Detached/Semi-Detached",119658.69,209402.7,155142.76,271499.83,185335.14,324336.5,220803.57,386406.25,259814.51,454675.4,284846.2,498480.85,309020.33,540785.57999999996]
[3,2022,"Region III -","PENNSYLVANIA","PA","PITTSBURGH",2,"Row House",94428.09,165249.16,123574.07,216254.62,149573.57,261753.75,182771.73,319850.53000000003,216701.25,379227.18,238724.24,417767.42,259284.91,453748.6]
[3,2022,"Region III -","PENNSYLVANIA","PA","PITTSBURGH",3,"Walkup",90558.65,158477.65,123567.52,216243.16,156529.49,273926.61,206377.51,361160.64,255788.94,447630.64,288244.78999999998,504428.38,320312.56,560546.98]
[3,2022,"Region III -","PENNSYLVANIA","PA","PITTSBURGH",4,"Elevator",96643.02,154628.84,135300.23000000001,216480.38,173957.44,278331.90999999997,231943.26,371109.22,289929.07,463886.52,328586.28000000003,525738.06000000006,367243.49,587589.6]
[3,2022,"Region III -","PENNSYLVANIA","PA","READING",1,"Detached/Semi-Detached",117006.17,204760.8,151792.07999999999,265636.14,181407.12,317462.46000000002,216231.13,378404.47,254502.21,445378.87,279061.26,488357.2,302815.67,529927.43000000005]
[3,2022,"Region III -","PENNSYLVANIA","PA","READING",2,"Row House",91775.58,160607.26999999999,120223.39,210390.93,145645.54999999999,254879.71,178199.29,311848.75,211388.95,369930.66,232939.29,407643.76,253080.25,442890.45]
[3,2022,"Region III -","PENNSYLVANIA","PA","READING",3,"Walkup",87590.56,153283.49,119412.19,208971.34,151186.93,264577.13,199254.09,348694.66,246884.67,432048.16,278153.28000000003,486768.24,309033.82,540809.18000000005]
[3,2022,"Region III -","PENNSYLVANIA","PA","READING",4,"Elevator",94207.42,150731.87,131890.39000000001,211024.62,169573.35,271317.37,226097.81,361756.49,282622.26,452195.62,320305.21999999997,512488.37,357988.19,572781.12]
[3,2022,"Region III -","PENNSYLVANIA","PA","SCRANTON",1,"Detached/Semi-Detached",112338.23,196591.9,145641.66,254872.9,173976.74,304459.3,207259.56,362704.23,243870.04,426772.58,267361.23,467882.15,290043.55,507576.22]
[3,2022,"Region III -","PENNSYLVANIA","PA","SCRANTON",2,"Row House",88713.22,155248.14000000001,116081.89,203143.3,140490.91,245859.09,171647.93,300383.88,203500.35,356125.62,224174.3,392305.03,243473.12,426077.96]
[3,2022,"Region III -","PENNSYLVANIA","PA","SCRANTON",3,"Walkup",85125.02,148968.79,116165,203288.75,147161.07,257531.87,194034.45,339560.29,240499.03,420873.31,271021.19,474287.08,301179.96000000002,527064.93000000005]
[3,2022,"Region III -","PENNSYLVANIA","PA","SCRANTON",4,"Elevator",90763.15,145221.03,127068.4,203309.45,163373.66,261397.86,217831.55,348530.48,272289.44,435663.1,308594.69,493751.52,344899.95,551839.93000000005]
[3,2022,"Region III -","PENNSYLVANIA","PA","STATE COLLEGE",1,"Detached/Semi-Detached",110337.34,193090.34,143186.64000000001,250576.61,171161.61,299532.82,204074.64,357130.62,240229.47,420401.58,263431.58,461005.26,285892.58,500312.01]
[3,2022,"Region III -","PENNSYLVANIA","PA","STATE COLLEGE",2,"Row House",86253.59,150943.78,113052.89,197842.55,137025.57,239794.74,167771.51999999999,293600.15999999997,199075.9,348382.83,219406.07,383960.62,238417.86,417231.26]
[3,2022,"Region III -","PENNSYLVANIA","PA","STATE COLLEGE",3,"Walkup",82098.14,143671.75,111868.92,195770.62,141594.94,247791.15,186570.61,326498.58,231129.54,404476.7,260372.45,455651.78,289244.90999999997,506178.59]
[3,2022,"Region III -","PENNSYLVANIA","PA","STATE COLLEGE",4,"Elevator",88685.32,141896.51,124159.44,198655.11,159633.57,255413.71,212844.76,340551.62,266055.95,425689.52,301530.07,482448.12,337004.2,539206.72]
[3,2022,"Region III -","PENNSYLVANIA","PA","WILKES-BARRE",1,"Detached/Semi-Detached",108564.15,189987.26,140837.95000000001,246466.4,168313.86,294549.25,200621.61,351087.82,236128.18,413224.31,258913.14,453098,280950.65000000002,491663.63]
[3,2022,"Region III -","PENNSYLVANIA","PA","WILKES-BARRE",2,"Row House",85168.51,149044.89000000001,111565.16,195239.03,135153.13,236517.97,165355.72,289372.52,196150.42,343263.24,216145.5,378254.63,234832.35,410956.61]
[3,2022,"Region III -","PENNSYLVANIA","PA","WILKES-BARRE",3,"Walkup",81295.89,142267.81,110833.44,193958.52,140327.51,245573.14,184944.21,323652.36,229156.07,401023.12,258180.83,451816.44,286845.71999999997,501980.02]
[3,2022,"Region III -","PENNSYLVANIA","PA","WILKES-BARRE",4,"Elevator",87417.97,139868.75,122385.15,195816.25,157352.34,251763.75,209803.12,335685,262253.90000000002,419606.24,297221.08,475553.74,332188.27,531501.24]
[3,2022,"Region III -","PENNSYLVANIA","PA","WILLIAMSPORT",1,"Detached/Semi-Detached",108154.76,189270.83,140393.32999999999,245688.32000000001,167855.54,293747.20000000001,200180.16,350315.28,235674.99,412431.23,258454.46,452295.3,280522.46000000002,490914.31]
[3,2022,"Region III -","PENNSYLVANIA","PA","WILLIAMSPORT",2,"Row House",84300.39,147525.68,110546.57,193456.49,134044.6,234578.05,164222.78,287389.87,194913.36,341098.38,214848.24,375984.42,233499.89,408624.81]
[3,2022,"Region III -","PENNSYLVANIA","PA","WILLIAMSPORT",3,"Walkup",80049.87,140087.26999999999,109030.56,190803.48,137966.92000000001,241442.11,181754.42,318070.23,225129.14,393976,253586.99,443777.23,281677.92,492936.36]
[3,2022,"Region III -","PENNSYLVANIA","PA","WILLIAMSPORT",4,"Elevator",86801.5,138882.4,121522.1,194435.36,156242.70000000001,249988.32,208323.6,333317.76000000001,260404.5,416647.2,295125.09999999998,472200.16,329845.7,527753.12]
[3,2022,"Region III -","PENNSYLVANIA","PA","YORK",1,"Detached/Semi-Detached",110988.96,194230.68,144082.29999999999,252144.02,172274.52,301480.40999999997,205462.18,359558.81,241901.22,423327.13,265286.89,464252.06,287946.28000000003,503905.98]
[3,2022,"Region III -","PENNSYLVANIA","PA","YORK",2,"Row House",86446.48,151281.32999999999,113374.57,198405.5,137488.26,240604.45,168467.57,294818.24,199963.77,349936.6,220422.8,385739.9,239567.28,419242.73]
[3,2022,"Region III -","PENNSYLVANIA","PA","YORK",3,"Walkup",82039.360000000001,143568.88,111728.18,195524.31,141371.38,247399.92,186230.2,325902.84999999998,230664.33,403662.59,259815.22,454676.64,288588.61,505030.07]
[3,2022,"Region III -","PENNSYLVANIA","PA","YORK",4,"Elevator",89043.1,142468.96,124660.33,199456.54,160277.57,256444.12,213703.43,341925.49,267129.28999999998,427406.87,302746.53000000003,484394.45,338363.76,541382.03]
[3,2022,"Region III -","VIRGINIA","VA","ALEXANDRIA",1,"Detached/Semi-Detached",115930.63,202878.6,150107.09,262687.40000000002,179148.68,313510.19,213187.95,373078.91,250697.99,438721.48,274761.84000000003,480833.22,297917.32,521355.31]
[3,2022,"Region III -","VIRGINIA","VA","ALEXANDRIA",2,"Row House",92764.36,162337.63,121121.29,211962.25,146313.06,256047.85,178267.8,311968.65000000002,211112.17,369446.3,232413.49,406723.61,252251.16,441439.53]
[3,2022,"Region III -","VIRGINIA","VA","ALEXANDRIA",3,"Walkup",89932.75,157382.31,122954.27,215169.97,155932.73000000001,272882.27,205772.34,360101.59,255211.07,446619.38,287724.82,503518.44,319882.23999999999,559793.93000000005]
[3,2022,"Region III -","VIRGINIA","VA","ALEXANDRIA",4,"Elevator",94302.34,150883.74,132023.26999999999,211237.23,169744.2,271590.73,226325.6,362120.97,282907.01,452651.22,320627.94,513004.71,358348.87,573358.21]
[3,2022,"Region III -","VIRGINIA","VA","ARLINGTON",1,"Detached/Semi-Detached",113869.18,199271.06,147539.31,258193.78,176169.91,308297.34000000003,209766.51,367091.39,246752.79,431817.37,270483.03999999998,473345.32,293359.96999999997,513379.95]
[3,2022,"Region III -","VIRGINIA","VA","ARLINGTON",2,"Row House",90473.54,158328.69,118266.52,206966.41,143009.18,250266.06,174500.62,305376.09000000003,206775.03,361856.31,227715.4,398501.95,247241.67,432672.93]
[3,2022,"Region III -","VIRGINIA","VA","ARLINGTON",3,"Walkup",87232.08,152656.13,119144.1,208502.18,151012.64000000001,264272.12,199191.05,348584.34,246964.63,432188.1,278363.86,487136.75,309403.23,541455.65]
[3,2022,"Region III -","VIRGINIA","VA","ARLINGTON",4,"Elevator",92289.18,147662.69,129204.85,206727.77,166120.51999999999,265792.84000000003,221494.03,354390.45,276867.53999999998,442988.07,313783.21000000002,502053.14,350698.88,561118.22]
[3,2022,"Region III -","VIRGINIA","VA","CHARLOTTESVILLE",1,"Detached/Semi-Detached",105427.16,184497.53,136585.17000000001,239024.05,163076.65,285384.14,194157,339774.75,228378.76,399662.83,250334.93,438086.13,271494.95,475116.17]
[3,2022,"Region III -","VIRGINIA","VA","CHARLOTTESVILLE",2,"Row House",83866.47,146766.32,109608.29,191814.51,132516.76,231904.34,161657.06,282899.86,191536.52,335188.90000000002,210921.62,369112.83,228993.78,400739.11]
[3,2022,"Region III -","VIRGINIA","VA","CHARLOTTESVILLE",3,"Walkup",80937.41,141640.46,110565.35,193489.36,140153.22,245268.14,184881.17,323542.05,229236.03,401163.06,258391.4,452184.96,287215.14,502626.5]
[3,2022,"Region III -","VIRGINIA","VA","CHARLOTTESVILLE",4,"Elevator",85499.73,136799.57,119699.62,191519.4,153899.51,246239.22,205199.35,328318.96999999997,256499.19,410398.71,290699.08,465118.53,324898.96999999997,519838.36]
[3,2022,"Region III -","VIRGINIA","VA","FREDERICKSBURG",1,"Detached/Semi-Detached",112277.67,196485.92,145528.9,254675.57,173813.1,304172.92,207023.04,362290.32,243565.4,426239.46,267012.07,467271.12,289637.17,506865.06]
[3,2022,"Region III -","VIRGINIA","VA","FREDERICKSBURG",2,"Row House",88882.03,155543.56,116256.11,203448.2,140652.35999999999,246141.64,171757.15,300575.02,203587.65,356278.39,224244.44,392427.76,243518.88,426158.04]
[3,2022,"Region III -","VIRGINIA","VA","FREDERICKSBURG",3,"Walkup",85451.22,149539.64000000001,116650.9,204139.08,147807.1,258662.43,194917,341104.75,241622.06,422838.61,272308.95,476540.66,302635.98,529612.97]
[3,2022,"Region III -","VIRGINIA","VA","FREDERICKSBURG",4,"Elevator",90827.82,145324.51,127158.94,203454.31,163490.07,261584.12,217986.76,348778.82,272483.45,435973.53,308814.58,494103.33,345145.7,552233.13]
[3,2022,"Region III -","VIRGINIA","VA","LYNCHBURG",1,"Detached/Semi-Detached",105366.6,184391.55,136472.41,238826.72,162913.01,285097.76,193920.48,339360.84,228074.12,399129.71,249985.77,437475.11,271088.57,474405]
[3,2022,"Region III -","VIRGINIA","VA","LYNCHBURG",2,"Row House",84035.28,147061.74,109782.52,192119.41,132678.22,232186.89,161766.29,283091.01,191623.82,335341.68,210991.75,369235.57,229039.54,400819.19]
[3,2022,"Region III -","VIRGINIA","VA","LYNCHBURG",3,"Walkup",81263.61,142211.31,111051.26,194339.7,140799.26,246398.7,185763.72,325086.51,230359.07,403128.36,259679.17,454438.54,288671.15999999997,505174.53]
[3,2022,"Region III -","VIRGINIA","VA","LYNCHBURG",4,"Elevator",85564.4,136903.04000000001,119790.16,191664.26,154015.92000000001,246425.48,205354.56,328567.3,256693.2,410709.13,290918.96000000002,465470.35,325144.71999999997,520231.56]
[3,2022,"Region III -","VIRGINIA","VA","NEWPORT NEWS",1,"Detached/Semi-Detached",109382.92,191420.11,141727.18,248022.56,169230.48,296153.34999999998,201504.52,352632.9,237034.55,414810.46,259830.5,454703.37,281807,493162.26]
[3,2022,"Region III -","VIRGINIA","VA","NEWPORT NEWS",2,"Row House",86904.76,152083.32,113602.34,198804.1,137370.17000000001,240397.8,167621.6,293337.81,198624.55,347592.96000000002,218740.02,382795.04,237497.27,415620.22]
[3,2022,"Region III -","VIRGINIA","VA","NEWPORT NEWS",3,"Walkup",83787.94,146628.89000000001,114439.2,200268.59,145048.68,253835.19,191323.78,334816.61,237209.91,415117.34,267368.49,467894.85,297181.32,520067.31]
[3,2022,"Region III -","VIRGINIA","VA","NEWPORT NEWS",4,"Elevator",88650.9,141841.44,124111.26,198578.01,159571.60999999999,255314.59,212762.15,340419.45,265952.69,425524.31,301413.05,482260.88,336873.41,538997.46]
[3,2022,"Region III -","VIRGINIA","VA","NORFOLK",1,"Detached/Semi-Detached",108200.79,189351.39,140161.38,245282.41,167331.98000000001,292830.96000000002,199202.49,348604.36,234300.34,410025.6,256818.2,449431.85,278512.37,487396.65]
[3,2022,"Region III -","VIRGINIA","VA","NORFOLK",2,"Row House",86181.37,150817.39000000001,112610.52,197068.41,136121.88,238213.28,166011.07,290519.37,196674.22,344179.89,216566.3,378991.03,235106.92,411437.11]
[3,2022,"Region III -","VIRGINIA","VA","NORFOLK",3,"Walkup",83253.100000000006,145692.92000000001,113748.87,199060.53,144203.72,252356.51,190239.5,332919.13,235894.26,412814.95,265907.40000000002,465337.95,295581.86,517268.25]
[3,2022,"Region III -","VIRGINIA","VA","NORFOLK",4,"Elevator",87805.99,140489.59,122928.39,196685.43,158050.79,252881.27,210734.39,337175.02,263417.98,421468.78,298540.38,477664.62,333662.78000000003,533860.46]
[3,2022,"Region III -","VIRGINIA","VA","PETERSBURG",1,"Detached/Semi-Detached",108852.41,190491.72,141057.04,246849.81,168444.87,294778.53000000003,200590.02,351032.54,235972.08,412951.14,258673.5,452678.63,280566.06,490990.61]
[3,2022,"Region III -","VIRGINIA","VA","PETERSBURG",2,"Row House",86374.25,151154.94,112932.2,197631.35,136584.56,239022.99,166707.10999999999,291737.44,197562.08,345733.65,217583.03,380770.3,236256.33,413448.57]
[3,2022,"Region III -","VIRGINIA","VA","PETERSBURG",3,"Walkup",83194.31,145590.04999999999,113608.13,198814.22,143980.16,251965.28,189899.08,332323.40000000002,235429.05,412000.83,265350.17,464362.8,294925.56,516119.72]
[3,2022,"Region III -","VIRGINIA","VA","PETERSBURG",4,"Elevator",88163.77,141062.04,123429.28,197486.85,158694.79,253911.67,211593.05,338548.89,264491.32,423186.12,299756.83,479610.93,335022.34000000003,536035.75]
[3,2022,"Region III -","VIRGINIA","VA","PORTSMOUTH",1,"Detached/Semi-Detached",105548.28,184709.48,136810.70000000001,239418.72,163403.95000000001,285956.90999999997,194630.04,340602.57,228988.04,400729.06,251033.25,439308.18,272307.71000000002,476538.49]
[3,2022,"Region III -","VIRGINIA","VA","PORTSMOUTH",2,"Row House",83528.850000000006,146175.49,109259.84,191204.72,132193.85,231339.23,161438.62,282517.58,191361.92000000001,334883.34999999998,210781.35,368867.37,228902.25,400578.95]
[3,2022,"Region III -","VIRGINIA","VA","PORTSMOUTH",3,"Walkup",80285,140498.76,109593.54,191788.7,138861.15,243007.02,183116.08,320453.13,226989.97,397232.46,255815.88,447677.79,284303.09999999998,497530.42]
[3,2022,"Region III -","VIRGINIA","VA","PORTSMOUTH",4,"Elevator",85370.39,136592.62,119518.54,191229.67,153666.70000000001,245866.72,204888.93,327822.28999999998,256111.16,409777.86,290259.31,464414.91,324407.46999999997,519051.96]
[3,2022,"Region III -","VIRGINIA","VA","RICHMOND",1,"Detached/Semi-Detached",113399.23,198448.66,146981.93,257218.38,175547.95,307208.92,209088.54,365904.94,245994.96,430491.19,269675.21000000002,471931.61,292525.42,511919.48]
[3,2022,"Region III -","VIRGINIA","VA","RICHMOND",2,"Row House",89774.23,157104.9,117422.16,205488.77,142062.12,248608.7,173476.91,303584.59000000003,205625.27,359844.23,226488.28,396354.49,245954.98,430421.22]
[3,2022,"Region III -","VIRGINIA","VA","RICHMOND",3,"Walkup",86312.26,151046.45000000001,117827.13,206197.48,149298.09,261271.66,196883.82,344546.69,244060.74,427106.3,275057.78999999998,481351.14,305691.46000000002,534960.05000000005]
[3,2022,"Region III -","VIRGINIA","VA","RICHMOND",4,"Elevator",91737.39,146779.82,128432.34,205491.75,165127.29999999999,264203.68,220169.73,352271.57,275212.15999999997,440339.46,311907.12,499051.39,348602.07,557763.31999999995]
[3,2022,"Region III -","VIRGINIA","VA","ROANOKE",1,"Detached/Semi-Detached",109261.8,191208.15,141501.65,247627.89,168903.18,295580.57,201031.47,351805.07,236425.26,413744.21,259132.18,453481.31,280994.24,491739.91]
[3,2022,"Region III -","VIRGINIA","VA","ROANOKE",2,"Row House",87242.37,152674.15,113950.79,199413.89,137693.09,240962.9,167840.05,293720.08,198799.14,347898.5,218880.28,383040.5,237588.78,415780.37]
[3,2022,"Region III -","VIRGINIA","VA","ROANOKE",3,"Walkup",84440.34,147770.59,115411,201969.26,146340.75,256096.31,193088.87,337905.52,239455.97,419047.94,269944.01,472402.01,300093.36,525163.37]
[3,2022,"Region III -","VIRGINIA","VA","ROANOKE",4,"Elevator",88780.24,142048.38,124292.33,198867.73,159804.43,255687.09,213072.57,340916.11,266340.71000000002,426145.14,301852.81,482964.5,337364.9,539783.85]
[3,2022,"Region III -","VIRGINIA","VA","WINCHESTER",1,"Detached/Semi-Detached",111156.11,194523.18,144075.87,252132.77,172078.24,301136.92,204957.54,358675.7,241135.85,421987.73,264348.94,462610.64,286748.93,501810.63]
[3,2022,"Region III -","VIRGINIA","VA","WINCHESTER",2,"Row House",87989.84,153982.21,115090.07,201407.62,139242.60999999999,243674.57,170037.4,297565.45,201550.03,352712.55,222000.59,388501.03,241082.78,421894.86]
[3,2022,"Region III -","VIRGINIA","VA","WINCHESTER",3,"Walkup",84590.19,148032.82999999999,115474.68,202080.69,146316.10999999999,256053.2,192950.18,337662.82,239183.38,418570.92,269560.11,471730.19,299580.5,524265.88]
[3,2022,"Region III -","VIRGINIA","VA","WINCHESTER",4,"Elevator",89918.25,143869.20000000001,125885.54,201416.87,161852.84,258964.55,215803.79,345286.07,269754.74,431607.59,305722.03999999998,489155.26,341689.33,546702.93999999994]
[3,2022,"Region III -","WEST VIRGINIA","WV","BECKLEY",1,"Detached/Semi-Detached",109909.61,192341.81,142685.18,249699.06,170607.45,298563.03999999998,203478.88,356088.04,239569.29,419246.27,262731.32,459779.81,285175.67999999999,499057.44]
[3,2022,"Region III -","WEST VIRGINIA","WV","BECKLEY",2,"Row House",85580.11,149765.19,112243.94,196426.9,136123.07999999999,238215.39,166805.32,291909.31,197995.79,346492.64,218256.57,381949.01,237216.53,415128.93]
[3,2022,"Region III -","WEST VIRGINIA","WV","BECKLEY",3,"Walkup",81197.42,142095.49,110576.6,193509.05,139910.56,244843.49,184302.1,322528.67,228272.64000000001,399477.11,257118.55,449957.47,285590.25,499782.94]
[3,2022,"Region III -","WEST VIRGINIA","WV","BECKLEY",4,"Elevator",88163.69,141061.91,123429.17,197486.68,158694.65,253911.44,211592.87,338548.59,264491.08,423185.74,299756.56,479610.51,335022.03999999998,536035.27]
[3,2022,"Region III -","WEST VIRGINIA","WV","BLUEFIELD",1,"Detached/Semi-Detached",111103.8,194431.65,144266.96,252467.18,172525.34,301919.34999999998,205804.4,360157.7,242331.41,424079.96,265774.37,465105.14,288503.94,504881.89]
[3,2022,"Region III -","WEST VIRGINIA","WV","BLUEFIELD",2,"Row House",86310.88,151044.04999999999,113245.89,198180.3,137384.12,240422.21,168432.29,294756.52,199966.03,349940.55,220452.48000000001,385791.84,239631.28,419354.73]
[3,2022,"Region III -","WEST VIRGINIA","WV","BLUEFIELD",3,"Walkup",81737.72,143041.01,111273.97,194729.45,140764.15,246337.26,185397.44,324445.52,229601.72,401803.01,258594.55,452540.46,287206.03999999998,502610.56]
[3,2022,"Region III -","WEST VIRGINIA","WV","BLUEFIELD",4,"Elevator",89017.22,142427.56,124624.11,199398.58,160231,256369.6,213641.33,341826.13,267051.65999999997,427282.67,302658.55,484253.69,338265.44,541224.71]
[3,2022,"Region III -","WEST VIRGINIA","WV","CHARLESTON",1,"Detached/Semi-Detached",114220.22,199885.39,148167.01999999999,259292.28,177065.63,309864.84999999998,211043.06,369325.36,248387.57,434678.25,272351.77,476615.59,295526.33,517171.07]
[3,2022,"Region III -","WEST VIRGINIA","WV","CHARLESTON",2,"Row House",89659.02,156903.28,117435.86,205512.76,142252.84,248942.46,174020.23,304535.40999999997,206418.13,361231.73,227453.45,398043.54,247110.42,432443.24]
[3,2022,"Region III -","WEST VIRGINIA","WV","CHARLESTON",3,"Walkup",85622.9,149840.07,116742.75,204299.81,147816.95000000001,258679.66,194822.56,340939.48,241403.16,422455.54,271984.67,475973.18,302188.39,528829.68999999994]
[3,2022,"Region III -","WEST VIRGINIA","WV","CHARLESTON",4,"Elevator",92000.31,147200.49,128800.43,206080.69,165600.54999999999,264960.88,220800.73,353281.18,276000.92,441601.47,312801.03999999998,500481.67,349601.16,559361.87]
[3,2022,"Region III -","WEST VIRGINIA","WV","CLARKSBURG",1,"Detached/Semi-Detached",109312.51,191296.9,141894.29,248315.01,169648.52,296884.90000000002,202316.13,354053.22,238188.25,416829.43,261209.81,457117.16,283511.56,496145.23]
[3,2022,"Region III -","WEST VIRGINIA","WV","CLARKSBURG",2,"Row House",85214.73,149125.76999999999,111742.97,195550.2,135492.57,237111.99,165991.84,290485.71999999997,197010.68,344768.69,217158.63,380027.6,236009.16,413016.04]
[3,2022,"Region III -","WEST VIRGINIA","WV","CLARKSBURG",3,"Walkup",80927.28,141622.73000000001,110227.92,192898.86,139483.78,244096.61,183754.43,321570.25,227608.1,398314.17,256380.56,448665.98,284782.36,498369.13]
[3,2022,"Region III -","WEST VIRGINIA","WV","CLARKSBURG",4,"Elevator",87736.93,140379.1,122831.71,196530.74,157926.48000000001,252682.37,210568.64,336909.83,263210.8,421137.29,298305.58,477288.93,333400.34999999998,533440.56999999995]
[3,2022,"Region III -","WEST VIRGINIA","WV","HUNTINGTON",1,"Detached/Semi-Detached",111831.85,195705.74,145003.48000000001,253756.08,173229.88,303152.28999999998,206392.05,361186.08,242863.38,425010.91,266265.71000000002,465964.99,288869.84999999998,505522.24]
[3,2022,"Region III -","WEST VIRGINIA","WV","HUNTINGTON",2,"Row House",88197.48,154345.59,115431.99,202005.98,139730.76999999999,244528.85,170766.3,298841.03000000003,202477.69,354335.95,223061.67,390357.92,242280.95999999999,423991.68]
[3,2022,"Region III -","WEST VIRGINIA","WV","HUNTINGTON",3,"Walkup",84542.31,147949.04999999999,115348.02,201859.03,146109.79,255692.14,192631.89,337105.81,238745.02,417803.78,269032.69,470807.21,298956.84000000003,523174.47]
[3,2022,"Region III -","WEST VIRGINIA","WV","HUNTINGTON",4,"Elevator",90293.26,144469.22,126410.57,202256.91,162527.87,260044.6,216703.83,346726.14,270879.78999999998,433407.67,306997.09999999998,491195.36,343114.4,548983.05000000005]
[3,2022,"Region III -","WEST VIRGINIA","WV","MORGANTOWN",1,"Detached/Semi-Detached",109312.51,191296.9,141894.29,248315.01,169648.52,296884.90000000002,202316.13,354053.22,238188.25,416829.43,261209.81,457117.16,283511.56,496145.23]
[3,2022,"Region III -","WEST VIRGINIA","WV","MORGANTOWN",2,"Row House",85214.73,149125.76999999999,111742.97,195550.2,135492.57,237111.99,165991.84,290485.71999999997,197010.68,344768.69,217158.63,380027.6,236009.16,413016.04]
[3,2022,"Region III -","WEST VIRGINIA","WV","MORGANTOWN",3,"Walkup",80927.28,141622.73000000001,110227.92,192898.86,139483.78,244096.61,183754.43,321570.25,227608.1,398314.17,256380.56,448665.98,284782.36,498369.13]
[3,2022,"Region III -","WEST VIRGINIA","WV","MORGANTOWN",4,"Elevator",87736.93,140379.1,122831.71,196530.74,157926.48000000001,252682.37,210568.64,336909.83,263210.8,421137.29,298305.58,477288.93,333400.34999999998,533440.56999999995]
[3,2022,"Region III -","WEST VIRGINIA","WV","PARKERSBURG",1,"Detached/Semi-Detached",109179.34,191063.84,141652.79999999999,247892.4,169301.85,296278.24,201819.6,353184.3,237551.08,415714.38,260480.76,455841.33,282665.19,494664.09]
[3,2022,"Region III -","WEST VIRGINIA","WV","PARKERSBURG",2,"Row House",85544.97,149703.69,112081.31,196142.29,135802.75,237654.81,166193.85999999999,290839.25,197165.39,345039.43,217276.72,380234.26,236076.3,413133.53]
[3,2022,"Region III -","WEST VIRGINIA","WV","PARKERSBURG",3,"Walkup",81574.22,142754.89000000001,111192.69,194587.21,140767.23000000001,246342.65,185508.47,324639.83,229840.74,402221.3,258941.18,453147.07,287678.09000000003,503436.66]
[3,2022,"Region III -","WEST VIRGINIA","WV","PARKERSBURG",4,"Elevator",87857.66,140572.26,123000.72,196801.16,158143.79,253030.06,210858.38,337373.41,263572.98,421716.77,298716.03999999998,477945.67,333859.09999999998,534174.56999999995]
[3,2022,"Region III -","WEST VIRGINIA","WV","WHEELING",1,"Detached/Semi-Detached",109843.02,192225.28,142564.43,249487.75,170434.12,298259.71000000002,203230.61,355653.58,239250.71,418688.74,262366.78999999998,459141.89,284752.49,498316.86]
[3,2022,"Region III -","WEST VIRGINIA","WV","WHEELING",2,"Row House",85745.23,150054.15,112413.11,196722.94,136278.17000000001,238486.8,166906.32999999999,292086.07,198073.14,346628,218315.62,382052.33,237250.1,415187.67]
[3,2022,"Region III -","WEST VIRGINIA","WV","WHEELING",3,"Walkup",81520.89,142661.57,111058.98,194353.22,140552.29,245966.5,185179.11,324063.45,229388.95,401430.67,258398.86,452198,287038.11,502316.69]
[3,2022,"Region III -","WEST VIRGINIA","WV","WHEELING",4,"Elevator",88224.06,141158.49,123513.68,197621.89,158803.29999999999,254085.28,211737.73,338780.38,264672.17,423475.47,299961.78999999998,479938.87,335251.40999999997,536402.27]
[4,2022,"Region IV - Southeast","ALABAMA","AL","ANNISTON",1,"Detached/Semi-Detached",87994.27,153989.98000000001,113949.93,199412.38,136008.69,238015.2,161869.19,283271.08,190361.25,333132.19,208640.15,365120.26,226235.27,395911.71]
[4,2022,"Region IV - Southeast","ALABAMA","AL","ANNISTON",2,"Row House",70316.479999999996,123053.83,91831.35,160704.85999999999,110952.37,194166.64,135222.20000000001,236638.85,160153.97,280269.45,176324.82,308568.44,191388.18,334929.31]
[4,2022,"Region IV - Southeast","ALABAMA","AL","ANNISTON",3,"Walkup",68099.75,119174.56,93087.34,162902.85,118042.08,206573.65,155758,272576.49,193168.01,338044.02,217768.14,381094.24,242096.36,423668.62]
[4,2022,"Region IV - Southeast","ALABAMA","AL","ANNISTON",4,"Elevator",71528.55,114445.69,100139.97,160223.96,128751.39,206002.23,171668.53,274669.64,214585.66,343337.06,243197.08,389115.33,271808.5,434893.6]
[4,2022,"Region IV - Southeast","ALABAMA","AL","BIRMINGHAM",1,"Detached/Semi-Detached",95549.7,167211.97,123729.72,216527,147678.07,258436.62,175752.18,307566.32,206684.63,361698.1,226529.03,396425.81,245629.32,429851.3]
[4,2022,"Region IV - Southeast","ALABAMA","AL","BIRMINGHAM",2,"Row House",76381,133666.76,99745.71,174554.99,120508.56,210889.98,146857.85999999999,257001.26,173929.75,304377.06,191488.32,335104.57,207843.32,363725.81]
[4,2022,"Region IV - Southeast","ALABAMA","AL","BIRMINGHAM",3,"Walkup",73993.289999999994,129488.26,101148.35,177009.62,128267.79,224468.62,169254.67,296195.68,209909.87,367342.27,236644.78,414128.36,263084.84999999998,460398.49]
[4,2022,"Region IV - Southeast","ALABAMA","AL","BIRMINGHAM",4,"Elevator",77684.33,124294.93,108758.06,174012.9,139831.79,223730.87,186442.39,298307.82,233052.98,372884.78,264126.71000000002,422602.75,295200.45,472320.72]
[4,2022,"Region IV - Southeast","ALABAMA","AL","DOTHAN",1,"Detached/Semi-Detached",95019.199999999997,166283.59,123059.58,215354.27,146892.46,257061.81,174837.69,305965.96000000002,205622.17,359838.8,225372.04,394401.08,244388.39,427679.67]
[4,2022,"Region IV - Southeast","ALABAMA","AL","DOTHAN",2,"Row House",75850.5,132738.38,99075.58,173382.26,119722.96,209515.17,145943.37,255400.9,172867.29,302517.75,190331.33,333079.84000000003,206602.39,361554.18]
[4,2022,"Region IV - Southeast","ALABAMA","AL","DOTHAN",3,"Walkup",73399.67,128449.43,100317.29,175555.25,127199.27,222598.73,167829.99,293702.48,208129.01,364225.77,234626.48,410596.34,260829.1,456450.93]
[4,2022,"Region IV - Southeast","ALABAMA","AL","DOTHAN",4,"Elevator",77197.210000000006,123515.53,108076.09,172921.75,138954.97,222327.96,185273.3,296437.28000000003,231591.62,370546.6,262470.5,419952.81,293349.39,469359.02]
[4,2022,"Region IV - Southeast","ALABAMA","AL","GADSDEN",1,"Detached/Semi-Detached",89073.62,155878.82999999999,115347.04,201857.32,137675.74,240932.55,163852.47,286741.82,192693.16,337213.03,211195.7,369592.47,229005.84,400760.22]
[4,2022,"Region IV - Southeast","ALABAMA","AL","GADSDEN",2,"Row House",71182.84,124569.96,92961.97,162683.45000000001,112317.53,196555.69,136884.44,239547.77,162121.94,283713.39,178491.04,312359.31,193738.91,339043.09]
[4,2022,"Region IV - Southeast","ALABAMA","AL","GADSDEN",3,"Walkup",68941.679999999993,120647.95,94238.92,164918.1,119502.9,209130.07,157686.09,275950.65999999997,195559.7,342229.48,220464.8,385813.4,245094.71,428915.74]
[4,2022,"Region IV - Southeast","ALABAMA","AL","GADSDEN",4,"Elevator",72407.95,115852.72,101371.13,162193.81,130334.31,208534.89,173779.08,278046.52,217223.84,347558.16,246187.02,393899.24,275150.2,440240.33]
[4,2022,"Region IV - Southeast","ALABAMA","AL","HUNTSVILLE",1,"Detached/Semi-Detached",96665.73,169165.03,125240.51,219170.9,149536.81,261689.42,178044.08,311577.14,209430.52,366503.42,229567.75,401743.55,248977.33,435710.33]
[4,2022,"Region IV - Southeast","ALABAMA","AL","HUNTSVILLE",2,"Row House",76858.080000000002,134501.63,100457.04,175799.82,121461.65,212557.89,148186.60999999999,259326.58,175583.81,307271.67,193359.01,338378.27,209931.8,367380.64]
[4,2022,"Region IV - Southeast","ALABAMA","AL","HUNTSVILLE",3,"Walkup",74144.62,129753.09,101278.81,177237.91,128376.18,224658.31,169340.23,296345.40000000002,209961.53,367432.67,236661.56,414157.73,263056.92,460349.61]
[4,2022,"Region IV - Southeast","ALABAMA","AL","HUNTSVILLE",4,"Elevator",78374.03,125398.46,109723.65,175557.84,141073.26,225717.22,188097.68,300956.28999999998,235122.1,376195.37,266471.71000000002,426354.75,297821.33,476514.13]
[4,2022,"Region IV - Southeast","ALABAMA","AL","MOBILE",1,"Detached/Semi-Detached",94525.38,165419.41,122503.13,214380.47,146298.54,256022.45,174231.81,304905.67,204973.69,358703.95,224698.21,393221.86,243724.88,426518.54]
[4,2022,"Region IV - Southeast","ALABAMA","AL","MOBILE",2,"Row House",74930.710000000006,131128.74,97986.14,171475.75,118525.27,207419.22,144695.4,253216.94,171490.92,300109.11,188878.81,330537.92,205099.19,358923.59]
[4,2022,"Region IV - Southeast","ALABAMA","AL","MOBILE",3,"Walkup",72115.45,126202.04,98465.1,172313.93,124778.33,218362.08,164562.76,287984.82,204008.12,357014.2,229928.28,402374.49,255547.06,447207.35]
[4,2022,"Region IV - Southeast","ALABAMA","AL","MOBILE",4,"Elevator",76520.39,122432.63,107128.55,171405.68,137736.71,220378.73,183648.94,293838.31,229561.18,367297.89,260169.33,416270.94,290777.49,465243.99]
[4,2022,"Region IV - Southeast","ALABAMA","AL","MONTGOMERY",1,"Detached/Semi-Detached",94488.69,165355.21,122389.45,214181.53,146106.85999999999,255687,173923.20000000001,304365.59999999998,204559.71,357979.49,224215.06,392376.35,243147.45,425508.04]
[4,2022,"Region IV - Southeast","ALABAMA","AL","MONTGOMERY",2,"Row House",75320,131810,98405.440000000002,172209.52,118937.35,208140.36,145028.88,253800.54,171804.83,300658.45,189174.35,331055.09999999998,205361.46,359382.55]
[4,2022,"Region IV - Southeast","ALABAMA","AL","MONTGOMERY",3,"Walkup",72806.06,127410.6,99486.22,174100.89,126130.76,220728.83,166405.31,291209.28999999998,206348.16,361109.28,232608.18,407064.31,258573.35,452503.37]
[4,2022,"Region IV - Southeast","ALABAMA","AL","MONTGOMERY",4,"Elevator",76710.09,122736.14,107394.12,171830.59,138078.15,220925.05,184104.21,294566.73,230130.26,368208.42,260814.29,417302.87,291498.33,466397.33]
[4,2022,"Region IV - Southeast","ALABAMA","AL","PHENIX CITY",1,"Detached/Semi-Detached",88506.43,154886.26,114563.23,200485.64,136698.45000000001,239222.29,162629.37,284601.40000000002,191216.72,334629.27,209555.56,366722.23,227187.48,397578.1]
[4,2022,"Region IV - Southeast","ALABAMA","AL","PHENIX CITY",2,"Row House",71041.62,124322.84,92711.13,162244.48000000001,111944.01,195902.02,136303.43,238531.01,161373.39000000001,282403.43,177629.58,310851.76,192760.24,337330.42]
[4,2022,"Region IV - Southeast","ALABAMA","AL","PHENIX CITY",3,"Walkup",69038.67,120817.67,94428.97,165250.69,119786.81,209626.91,158103.95000000001,276681.92,196118.88,343208.05,221126.38,386971.17,245865.25,430264.19]
[4,2022,"Region IV - Southeast","ALABAMA","AL","PHENIX CITY",4,"Elevator",72110.52,115376.83,100954.73,161527.57,129798.94,207678.3,173065.25,276904.40000000002,216331.56,346130.5,245175.77,392281.23,274019.96999999997,438431.97]
[4,2022,"Region IV - Southeast","ALABAMA","AL","TUSCALOOSA",1,"Detached/Semi-Detached",91177.29,159560.26,117970.75,206448.81,140722.32,246264.06,167356.13,292873.21999999997,196736.02,344288.03,215582.09,377268.65,233680.86,408941.51]
[4,2022,"Region IV - Southeast","ALABAMA","AL","TUSCALOOSA",2,"Row House",73499.490000000005,128624.11,95852.160000000003,167741.29,115666,202415.5,140709.14000000001,246241,166528.74,291425.3,183266.77,320716.84000000003,198833.77,347959.11]
[4,2022,"Region IV - Southeast","ALABAMA","AL","TUSCALOOSA",3,"Walkup",71661.460000000006,125407.56,98073.74,171629.05,124453.17,217793.04,164306.10999999999,287535.69,203853.15,356743.01,229877.96,402286.43,255630.86,447354.01]
[4,2022,"Region IV - Southeast","ALABAMA","AL","TUSCALOOSA",4,"Elevator",74451.28,119122.05,104231.79,166770.87,134012.31,214419.69,178683.08,285892.93,223353.84,357366.16,253134.36,405014.98,282914.87,452663.8]
[4,2022,"Region IV - Southeast","FLORIDA","FL","DAYTONA BEACH",1,"Detached/Semi-Detached",97818.44,171182.27,126864.98,222013.72,151587.24,265277.65999999997,180644.58,316128.02,212590.39,372033.18,233089.6,407906.8,252902.76,442579.83]
[4,2022,"Region IV - Southeast","FLORIDA","FL","DAYTONA BEACH",2,"Row House",76945.86,134655.25,100749.07,176310.86,122002.66,213504.66,149181.88,261068.29,176923.96,309616.93,194934.16,341134.78,211758.01,370576.51]
[4,2022,"Region IV - Southeast","FLORIDA","FL","DAYTONA BEACH",3,"Walkup",73605.350000000006,128809.36,100388.14,175679.24,127132.14,222481.24,167583.23000000001,293270.65000000002,207673.14,363428,233998.44,409497.27,260002.69,455004.71]
[4,2022,"Region IV - Southeast","FLORIDA","FL","DAYTONA BEACH",4,"Elevator",78874.039999999994,126198.47,110423.66,176677.86,141973.28,227157.25,189297.7,302876.33,236622.13,378595.41,268171.75,429074.8,299721.36,479554.19]
[4,2022,"Region IV - Southeast","FLORIDA","FL","FORT MYERS",1,"Detached/Semi-Detached",96878.55,169537.47,125750.23,220062.91,150343.32,263100.81,179288.64,313755.13,211074.74,369380.8,231473.93,405079.39,251233.65,439658.89]
[4,2022,"Region IV - Southeast","FLORIDA","FL","FORT MYERS",2,"Row House",75547.23,132207.66,99060.34,173355.6,120108.54,210189.94,147134.45000000001,257485.29,174624.44,305592.77,192479.91,336839.85,209184.62,366073.08]
[4,2022,"Region IV - Southeast","FLORIDA","FL","FORT MYERS",3,"Walkup",71765.710000000006,125589.99,97754.2,171069.85,123703.03999999999,216480.32,162968.76999999999,285195.34000000003,201865.37,353264.4,227386.31,397926.05,252579.15,442013.51]
[4,2022,"Region IV - Southeast","FLORIDA","FL","FORT MYERS",4,"Elevator",77770.460000000006,124432.73,108878.64,174205.83,139986.82,223978.92,186649.1,298638.56,233311.37,373298.2,264419.56,423071.3,295527.74,472844.39]
[4,2022,"Region IV - Southeast","FLORIDA","FL","GAINESVILLE",1,"Detached/Semi-Detached",95696.43,167468.75,124184.44,217322.77,148444.82,259778.43,176986.63,309726.59999999998,208340.55,364595.96,228461.64,399807.88,247939.03,433893.31]
[4,2022,"Region IV - Southeast","FLORIDA","FL","GAINESVILLE",2,"Row House",74823.850000000006,130941.73,98068.52,171619.91,118860.24,208005.43,145523.92000000001,254666.86,172674.12,302179.71000000002,190306.2,333035.84999999998,206794.28,361889.99]
[4,2022,"Region IV - Southeast","FLORIDA","FL","GAINESVILLE",3,"Walkup",71230.880000000005,124654.03,97063.88,169861.79,122858.09,215001.65,161884.49,283297.87,200549.72,350962.01,225925.23,395369.16,250979.69,439214.46]
[4,2022,"Region IV - Southeast","FLORIDA","FL","GAINESVILLE",4,"Elevator",76925.56,123080.9,107695.78,172313.25,138466.01,221545.61,184621.34,295394.15000000002,230776.68,369242.69,261546.9,418475.05,292317.12,467707.4]
[4,2022,"Region IV - Southeast","FLORIDA","FL","JACKSONVILLE",1,"Detached/Semi-Detached",100182.69,175319.7,129996.57,227494,155384.24,271922.43,185248.62,324185.08,218058.78,381602.87,239114.18,418449.82,259492,454111]
[4,2022,"Region IV - Southeast","FLORIDA","FL","JACKSONVILLE",2,"Row House",78392.63,137187.1,102732.7,179782.23,124499.25,217873.69,152402.94,266705.14,180824.6,316443.05,199281.58,348742.77,216538.69,378942.7]
[4,2022,"Region IV - Southeast","FLORIDA","FL","JACKSONVILLE",3,"Walkup",74675.02,130681.28,101768.78,178095.37,128822.05,225438.58,169751.77,297065.59999999998,210304.44,368032.77,236920.6,414611.05,263201.59999999998,460602.8]
[4,2022,"Region IV - Southeast","FLORIDA","FL","JACKSONVILLE",4,"Elevator",80563.839999999997,128902.15,112789.38,180463.01,145014.92000000001,232023.87,193353.22,309365.15999999997,241691.53,386706.45,273917.06,438267.31,306142.59999999998,489828.16]
[4,2022,"Region IV - Southeast","FLORIDA","FL","LAKELAND",1,"Detached/Semi-Detached",97530.17,170677.8,126645.89,221630.3,151456.21,265048.38,180676.17,316183.28999999998,212746.48,372306.33,233329.23,408326.15,253287.33,443252.84]
[4,2022,"Region IV - Southeast","FLORIDA","FL","LAKELAND",2,"Row House",75740.12,132545.20000000001,99382.02,173918.53,120571.22,210999.64,147830.49,258703.35,175512.29,307146.51,193496.63,338619.1,210334.02,368084.54]
[4,2022,"Region IV - Southeast","FLORIDA","FL","LAKELAND",3,"Walkup",71706.92,125487.11,97613.45,170823.54,123479.48,216089.09,162628.34,284599.59999999998,201400.16,352450.27,226829.08,396950.89,251922.84,440864.98]
[4,2022,"Region IV - Southeast","FLORIDA","FL","LAKELAND",4,"Elevator",78128.23,125005.18,109379.53,175007.25,140630.82,225009.32,187507.76,300012.42,234384.7,375015.53,265635.99,425017.59999999998,296887.28999999998,475019.67]
[4,2022,"Region IV - Southeast","FLORIDA","FL","MIAMI",1,"Detached/Semi-Detached",101834.76,178210.82,132119.74,231209.55,157904.71,276333.24,188228.61,329400.07,221550.81,387713.91,242934.31,425135.05,263621.18,461337.07]
[4,2022,"Region IV - Southeast","FLORIDA","FL","MIAMI",2,"Row House",79815.33,139676.82999999999,104568.89,182995.55,126694.61,221715.57,155037.19,271315.08,183924.69,321868.2,202682.42,354694.24,220215.73,385377.52]
[4,2022,"Region IV - Southeast","FLORIDA","FL","MIAMI",3,"Walkup",76129.67,133226.93,103776.08,181608.14,131381.56,229917.73,173143.28,303000.74,214523.98,375416.97,241687.76,422953.57,268512.84000000003,469897.47]
[4,2022,"Region IV - Southeast","FLORIDA","FL","MIAMI",4,"Elevator",81960.539999999994,131136.85999999999,114744.75,183591.6,147528.97,236046.35,196705.29,314728.46000000002,245881.61,393410.58,278665.82,445865.32,311450.03999999998,498320.07]
[4,2022,"Region IV - Southeast","FLORIDA","FL","ORLANDO",1,"Detached/Semi-Detached",101304.25,177282.44,131449.60000000001,230036.81,157119.1,274958.42,187314.12,327799.7,220488.34,385854.6,241777.32,423110.31,262380.24,459165.42]
[4,2022,"Region IV - Southeast","FLORIDA","FL","ORLANDO",2,"Row House",79284.83,138748.45000000001,103898.75,181822.8,125909,220340.75,154122.69,269714.71000000002,182862.22,320008.89,201525.43,352669.49,218974.79,383205.88]
[4,2022,"Region IV - Southeast","FLORIDA","FL","ORLANDO",3,"Walkup",75536.05,132188.09,102945.01,180153.76,130313.04,228047.82,171718.59,300507.53000000003,212743.12,372300.46,239669.44,419421.52,266257.08,465949.89]
[4,2022,"Region IV - Southeast","FLORIDA","FL","ORLANDO",4,"Elevator",81473.41,130357.46,114062.78,182500.45,146652.14000000001,234643.43,195536.19,312857.90999999997,244420.24,391072.39,277009.59999999998,443215.37,309598.96999999997,495358.36]
[4,2022,"Region IV - Southeast","FLORIDA","FL","PANAMA CITY",1,"Detached/Semi-Detached",92498.87,161873.03,119818.9,209683.08,143043.96,250326.93,170285.49,297999.61,200286.48,350501.35,219534.27,384184.97,238076.95,416634.67]
[4,2022,"Region IV - Southeast","FLORIDA","FL","PANAMA CITY",2,"Row House",73690.62,128958.58,96285.88,168500.29,116385.33,203674.33,141934.48000000001,248385.34,168147.51,294258.13,185152.44,324016.78000000003,201001.46,351752.55]
[4,2022,"Region IV - Southeast","FLORIDA","FL","PANAMA CITY",3,"Walkup",71198.59,124597.53,97281.69,170242.96,123329.83,215827.21,162704,284732,201752.71,353067.25,227423.57,397991.24,252805.13,442408.97]
[4,2022,"Region IV - Southeast","FLORIDA","FL","PANAMA CITY",4,"Elevator",75071.990000000005,120115.19,105100.79,168161.26,135129.57999999999,216207.34,180172.78,288276.45,225215.97,360345.56,255244.77,408391.64,285273.57,456437.71]
[4,2022,"Region IV - Southeast","FLORIDA","FL","PENSACOLA",1,"Detached/Semi-Detached",94272.06,164976.10999999999,122167.6,213793.3,145891.72,255310.51,173738.52,304042.42,204387.79,357678.63,224052.72,392092.25,243018.89,425283.06]
[4,2022,"Region IV - Southeast","FLORIDA","FL","PENSACOLA",2,"Row House",74775.7,130857.47,97773.61,171103.81,118257.78,206951.11,144350.28,252612.99,171072.99,299377.74,188413.02,329722.78000000003,204586.98,358027.21]
[4,2022,"Region IV - Southeast","FLORIDA","FL","PENSACOLA",3,"Walkup",72000.84,126001.48,98317.17,172055.05,124597.27,218045.22,164330.41,287578.21999999997,203726.19,356520.83,229615.19,401826.59,255204.31,446607.55]
[4,2022,"Region IV - Southeast","FLORIDA","FL","PENSACOLA",4,"Elevator",76339.34,122142.95,106875.08,171000.13,137410.82,219857.31,183214.42,293143.08,229018.03,366428.85,259553.76,415286.03,290089.5,464143.21]
[4,2022,"Region IV - Southeast","FLORIDA","FL","SARASOTA",1,"Detached/Semi-Detached",102486.38,179351.16,133015.4,232776.95,159017.60999999999,278280.81,189616.14,331828.25,223222.55,390639.46,244789.62,428381.83,265674.87,464931.02]
[4,2022,"Region IV - Southeast","FLORIDA","FL","SARASOTA",2,"Row House",80008.210000000006,140014.38,104890.57,183558.49,127157.3,222525.27,155733.23000000001,272533.15000000002,184812.55,323421.96000000002,203699.14,356473.5,221365.13,387388.99]
[4,2022,"Region IV - Southeast","FLORIDA","FL","SARASOTA",3,"Walkup",76070.89,133124.04999999999,103635.33,181361.83,131158,229526.49,172802.86,302405.01,214058.77,374602.85,241130.53,421978.42,267856.53999999998,468748.95]
[4,2022,"Region IV - Southeast","FLORIDA","FL","SARASOTA",4,"Elevator",82318.31,131709.29999999999,115245.64,184393.03,148172.97,237076.75,197563.95,316102.33,246954.94,395127.91,279882.27,447811.64,312809.59000000003,500495.35999999999]
[4,2022,"Region IV - Southeast","FLORIDA","FL","TALLAHASSEE",1,"Detached/Semi-Detached",100122.13,175213.72,129883.81,227296.67,155220.6,271636.03999999998,185012.1,323771.17,217754.14,381069.75,238765.03,417838.8,259085.62,453399.84]
[4,2022,"Region IV - Southeast","FLORIDA","FL","TALLAHASSEE",2,"Row House",78561.440000000002,137482.51999999999,102906.93,180087.12,124660.71,218156.24,152512.16,266896.28000000003,180911.9,316595.83,199351.71,348865.5,216584.45,379022.78]
[4,2022,"Region IV - Southeast","FLORIDA","FL","TALLAHASSEE",3,"Walkup",75001.22,131252.13,102254.69,178945.7,129468.08,226569.15,170634.32,298610.06,211427.47,369998.07,238208.36,416864.63,264657.62,463150.84]
[4,2022,"Region IV - Southeast","FLORIDA","FL","TALLAHASSEE",4,"Elevator",80628.509999999995,129005.62,112879.92,180607.87,145131.32,232210.12,193508.43,309613.49,241885.54,387016.87,274136.94,438619.12,306388.34999999998,490221.37]
[4,2022,"Region IV - Southeast","FLORIDA","FL","TAMPA",1,"Detached/Semi-Detached",101364.81,177388.42,131562.37,230234.15,157282.75,275244.82,187550.64,328213.63,220792.99,386387.73,242126.48,423721.35,262786.63,459876.6]
[4,2022,"Region IV - Southeast","FLORIDA","FL","TAMPA",2,"Row House",79116.02,138453.03,103724.52,181517.91,125747.55,220058.21,154013.47,269523.58,182774.93,319856.12,201455.3,352546.77,218929.03,383125.81]
[4,2022,"Region IV - Southeast","FLORIDA","FL","TAMPA",3,"Walkup",75209.850000000006,131617.24,102459.11,179303.43,129667.01,226917.26,170836.04,298963.08,211620.09,370335.16,238381.69,417167.95,264801.06,463401.86]
[4,2022,"Region IV - Southeast","FLORIDA","FL","TAMPA",4,"Elevator",81408.740000000005,130253.99,113972.24,182355.59,146535.74,234457.18,195380.98,312609.58,244226.23,390761.98,276789.73,442863.57,309353.23,494965.17]
[4,2022,"Region IV - Southeast","GEORGIA","GA","ALBANY",1,"Detached/Semi-Detached",93620.44,163835.76999999999,121271.94,212225.89,144778.82,253362.93,172350.99,301614.23,202716.04,354753.07,222197.4,388845.46,240965.19,421689.09]
[4,2022,"Region IV - Southeast","GEORGIA","GA","ALBANY",2,"Row House",74582.81,130519.92,97451.92,170540.87,117795.09,206141.4,143654.24,251394.91,170185.13,297823.96999999997,187396.29,327943.5,203437.56,356015.73]
[4,2022,"Region IV - Southeast","GEORGIA","GA","ALBANY",3,"Walkup",72059.63,126104.34,98457.919999999998,172301.35,124820.82,218436.44,164670.82,288173.94,204191.39,357334.94,230172.41,402801.72,255860.6,447756.05]
[4,2022,"Region IV - Southeast","GEORGIA","GA","ALBANY",4,"Elevator",75981.56,121570.5,106374.19,170198.7,136766.81,218826.9,182355.75,291769.2,227944.68,364711.5,258337.31,413339.7,288729.93,461967.9]
[4,2022,"Region IV - Southeast","GEORGIA","GA","ATHENS",1,"Detached/Semi-Detached",94453.74,165294.04999999999,122505.88,214385.29,146382.66,256169.66,174448.08,305284.14,205301.7,359277.98,225100.19,393925.32,244238.03,427416.55]
[4,2022,"Region IV - Southeast","GEORGIA","GA","ATHENS",2,"Row House",74269.27,129971.22,97250.93,170189.12,117773.4,206103.46,144022.60999999999,252039.57,170811.09,298919.40999999997,188202.62,329354.58,204449.69,357786.96]
[4,2022,"Region IV - Southeast","GEORGIA","GA","ATHENS",3,"Walkup",71022.240000000005,124288.92,96859.46,169504.05,122659.16,214653.54,161682.76999999999,282944.84000000003,200357.1,350624.93,225751.91,395065.84,250836.25,438963.44]
[4,2022,"Region IV - Southeast","GEORGIA","GA","ATHENS",4,"Elevator",76145.33,121832.53,106603.46,170565.54,137061.59,219298.55,182748.79,292398.07,228435.99,365497.58,258894.12,414230.59,289352.25,462963.6]
[4,2022,"Region IV - Southeast","GEORGIA","GA","ATLANTA",1,"Detached/Semi-Detached",104957.21,183675.13,136027.79999999999,238048.65,162454.70000000001,284295.71999999997,193479.03,338588.31,227620.94,398336.64,249527.1,436672.42,270660.40000000002,473655.7]
[4,2022,"Region IV - Southeast","GEORGIA","GA","ATLANTA",2,"Row House",83167.16,145542.53,108763.93,190336.88,131569.70000000001,230246.98,160633.35,281108.37,190386.76,333176.82,209694.5,366965.37,227707.08,398487.4]
[4,2022,"Region IV - Southeast","GEORGIA","GA","ATLANTA",3,"Walkup",80017.59,140030.78,109248.38,191184.67,138438.68,242267.68,182573.94,319504.40000000002,226332.15,396081.26,255085.34,446399.35,283503.37,496130.9]
[4,2022,"Region IV - Southeast","GEORGIA","GA","ATLANTA",4,"Elevator",84947.94,135916.70000000001,118927.11,190283.38,152906.29,244650.06,203875.05,326200.08,254843.81,407750.1,288822.99,462116.78,322802.15999999997,516483.46]
[4,2022,"Region IV - Southeast","GEORGIA","GA","AUGUSTA",1,"Detached/Semi-Detached",95742.45,167549.29,123952.48,216916.84,147921.24,258862.17,176008.95,308015.65999999997,206965.89,362190.31,226825.37,396944.39,245928.93,430375.62]
[4,2022,"Region IV - Southeast","GEORGIA","GA","AUGUSTA",2,"Row House",76704.820000000007,134233.44,100132.47,175231.82,120937.51,211640.64,147312.20000000001,257796.35,174434.97,305261.2,192024.25,336042.44,208401.29,364702.27]
[4,2022,"Region IV - Southeast","GEORGIA","GA","AUGUSTA",3,"Walkup",74434.100000000006,130259.68,101782.18,178118.82,129094.88,225916.04,170369.56,298146.74,211314.82,369800.94,238245.63,416929.85,264883.61,463546.32]
[4,2022,"Region IV - Southeast","GEORGIA","GA","AUGUSTA",4,"Elevator",77930.05,124688.08,109102.07,174563.31,140274.09,224438.54,187032.12,299251.39,233790.15,374064.24,264962.17,423939.47,296134.19,473814.7]
[4,2022,"Region IV - Southeast","GEORGIA","GA","COLUMBUS",1,"Detached/Semi-Detached",93620.44,163835.76999999999,121271.94,212225.89,144778.82,253362.93,172350.99,301614.23,202716.04,354753.07,222197.4,388845.46,240965.19,421689.09]
[4,2022,"Region IV - Southeast","GEORGIA","GA","COLUMBUS",2,"Row House",74582.81,130519.92,97451.92,170540.87,117795.09,206141.4,143654.24,251394.91,170185.13,297823.96999999997,187396.29,327943.5,203437.56,356015.73]
[4,2022,"Region IV - Southeast","GEORGIA","GA","COLUMBUS",3,"Walkup",72059.63,126104.34,98457.919999999998,172301.35,124820.82,218436.44,164670.82,288173.94,204191.39,357334.94,230172.41,402801.72,255860.6,447756.05]
[4,2022,"Region IV - Southeast","GEORGIA","GA","COLUMBUS",4,"Elevator",75981.56,121570.5,106374.19,170198.7,136766.81,218826.9,182355.75,291769.2,227944.68,364711.5,258337.31,413339.7,288729.93,461967.9]
[4,2022,"Region IV - Southeast","GEORGIA","GA","MACON",1,"Detached/Semi-Detached",94863.12,166010.47,122950.49,215163.37,146840.97,256971.7,174889.53,306056.68,205754.89,360071.05,225558.86,394728.01,244666.2,428165.85]
[4,2022,"Region IV - Southeast","GEORGIA","GA","MACON",2,"Row House",75137.39,131490.43,98269.52,171971.66,118881.92,208043.37,145155.54999999999,254022.21,172048.15,301084.27,189499.87,331624.78000000003,205782.15,360118.76]
[4,2022,"Region IV - Southeast","GEORGIA","GA","MACON",3,"Walkup",72268.259999999995,126469.46,98662.33,172659.09,125019.75,218784.56,164872.54999999999,288526.96000000002,204384.02,357672.03,230345.73,403105.03,256004.04,448007.08]
[4,2022,"Region IV - Southeast","GEORGIA","GA","MACON",4,"Elevator",76761.789999999994,122818.87,107466.51,171946.42,138171.23000000001,221073.96,184228.3,294765.28999999998,230285.38,368456.61,260990.09,417584.16,291694.81,466711.7]
[4,2022,"Region IV - Southeast","GEORGIA","GA","SAVANNAH",1,"Detached/Semi-Detached",98758.32,172827.07,127979.73,223964.53,152831.15,267454.52,182000.52,318500.90999999997,214106.03,374685.55,234705.26,410734.21,254571.86,445500.76]
[4,2022,"Region IV - Southeast","GEORGIA","GA","SAVANNAH",2,"Row House",78344.479999999996,137102.84,102437.79,179266.13,123896.79,216819.38,151229.29999999999,264651.28000000003,179223.48,313641.09000000003,197388.4,345429.71,214331.39,375079.93]
[4,2022,"Region IV - Southeast","GEORGIA","GA","SAVANNAH",3,"Walkup",75444.990000000005,132028.73000000001,103022.08,180288.65,130561.24,228482.16,172197.7,301345.96999999997,213480.92,373591.6,240610.57,421068.5,267426.24,467995.92]
[4,2022,"Region IV - Southeast","GEORGIA","GA","SAVANNAH",4,"Elevator",79977.63,127964.21,111968.68,179149.89,143959.73000000001,230335.57,191946.31,307114.09999999998,239932.88,383892.62,271923.94,435078.3,303914.99,486263.99]
[4,2022,"Region IV - Southeast","GEORGIA","GA","VALDOSTA",1,"Detached/Semi-Detached",91498.43,160122.25,118591.39,207534.94,141636.4,247863.7,168693.03,295212.79999999999,198466.2,347315.85,217569.45,380746.53,236001.47,413002.57]
[4,2022,"Region IV - Southeast","GEORGIA","GA","VALDOSTA",2,"Row House",72460.800000000003,126806.39999999999,94771.38,165849.92000000001,114652.67,200642.17,139996.28,244993.49,165935.28,290386.75,182768.33,319844.58,198473.83,347329.21]
[4,2022,"Region IV - Southeast","GEORGIA","GA","VALDOSTA",3,"Walkup",69685.149999999994,121949.02,95133.65,166483.9,120546.77,210956.85,158972.09,278201.15000000002,197067.97,344868.96,222099.20000000001,388673.6,246837.61,431965.81]
[4,2022,"Region IV - Southeast","GEORGIA","GA","VALDOSTA",4,"Elevator",74033.08,118452.93,103646.31,165834.1,133259.54,213215.27,177679.39,284287.02,222099.23,355358.78,251712.46,402739.95,281325.69,450121.12]
[4,2022,"Region IV - Southeast","KENTUCKY","KY","ASHLAND",1,"Detached/Semi-Detached",104911.19,183594.57,136259.75,238454.56,162978.26,285211.96000000002,194456.7,340299.22,228995.58,400742.27,251163.36,439535.88,272670.49,477173.36]
[4,2022,"Region IV - Southeast","KENTUCKY","KY","ASHLAND",2,"Row House",81286.179999999993,142250.81,106699.98,186724.96,129492.43,226611.75,158845.07,277978.86,188625.89,330095.31,207976.43,363958.76,226100.05,395675.09]
[4,2022,"Region IV - Southeast","KENTUCKY","KY","ASHLAND",3,"Walkup",76814.36,134425.12,104530.07,182927.62,132201.87,231353.27,174088.86,304655.5,215567.04,377242.32,242764.93,424838.62,269599.43,471799.01]
[4,2022,"Region IV - Southeast","KENTUCKY","KY","ASHLAND",4,"Elevator",83943.44,134309.51,117520.82,188033.31,151098.20000000001,241757.12,201464.26,322342.82,251830.32,402928.53,285407.7,456652.33,318985.08,510376.13]
[4,2022,"Region IV - Southeast","KENTUCKY","KY","BOWLING GREEN",1,"Detached/Semi-Detached",103016.88,180279.55,133685.54,233949.7,159803.22,279655.63,190530.64,333428.61,224285.01,392498.77,245946.61,430406.58,266915.81,467102.67]
[4,2022,"Region IV - Southeast","KENTUCKY","KY","BOWLING GREEN",2,"Row House",80538.720000000001,140942.76,105560.71,184731.24,127942.91,223900.09,156647.72,274133.52,185875.01,325281.28000000003,204856.14,358498.24,222606.07,389560.63]
[4,2022,"Region IV - Southeast","KENTUCKY","KY","BOWLING GREEN",3,"Walkup",76664.509999999995,134162.89000000001,104466.4,182816.2,132226.51999999999,231396.4,174227.56,304898.21999999997,215839.64,377719.36,243148.84,425510.47,270112.3,472696.53]
[4,2022,"Region IV - Southeast","KENTUCKY","KY","BOWLING GREEN",4,"Elevator",82805.440000000002,132488.70000000001,115927.61,185484.18,149049.79,238479.67,198733.05,317972.89,248416.31,397466.11,281538.49,450461.59,314660.67,503457.07]
[4,2022,"Region IV - Southeast","KENTUCKY","KY","COVINGTON",1,"Detached/Semi-Detached",101485.93,177600.38,131787.89000000001,230628.81,157610.04999999999,275817.58,188023.67999999999,329041.45,221402.27,387453.96,242824.8,424943.4,263599.39,461298.93]
[4,2022,"Region IV - Southeast","KENTUCKY","KY","COVINGTON",2,"Row House",78778.399999999994,137862.20000000001,103376.07,180908.12,125424.63,219493.1,153795.03,269141.3,182600.33,319550.57,201315.03,352301.31,218837.51,382965.64]
[4,2022,"Region IV - Southeast","KENTUCKY","KY","COVINGTON",3,"Walkup",74557.45,130475.54,101487.3,177602.77,128374.94,224656.14,169070.95,295874.15999999997,209374.03,366404.55,235806.16,412660.78,261889.02,458305.79]
[4,2022,"Region IV - Southeast","KENTUCKY","KY","COVINGTON",4,"Elevator",81279.399999999994,130047.03999999999,113791.16,182065.86,146302.92000000001,234084.68,195070.56,312112.90000000002,243838.2,390141.13,276349.96000000002,442159.95,308861.71999999997,494178.76]
[4,2022,"Region IV - Southeast","KENTUCKY","KY","FRANKFORT",1,"Detached/Semi-Detached",104547.83,182958.71,135583.19,237270.58,161996.39000000001,283493.67,193037.58,337815.77,227167.76,397543.57,249068.43,435869.74,270232.23,472906.4]
[4,2022,"Region IV - Southeast","KENTUCKY","KY","FRANKFORT",2,"Row House",82299.039999999994,144023.32,107745.34,188554.34,130461.18,228307.06,159500.41,279125.73,189149.7,331011.96999999997,208397.24,364695.17,226374.63,396155.6]
[4,2022,"Region IV - Southeast","KENTUCKY","KY","FRANKFORT",3,"Walkup",78771.570000000007,137850.23999999999,107445.5,188029.63,136078.09,238136.65,179384.16,313922.27,222305.23,389034.15,250491.51,438360.14,278335.57,487087.25]
[4,2022,"Region IV - Southeast","KENTUCKY","KY","FRANKFORT",4,"Elevator",84331.47,134930.35999999999,118064.06,188902.5,151796.65,242874.65,202395.53,323832.86,252994.42,404791.08,286727.01,458763.22,320459.59999999998,512735.36]
[4,2022,"Region IV - Southeast","KENTUCKY","KY","LEXINGTON",1,"Detached/Semi-Detached",104017.33,182030.33,134913.04999999999,236097.84,161210.78,282118.87,192123.09,336215.42,226105.3,395684.27,247911.44,433845.01,268991.28999999998,470734.77]
[4,2022,"Region IV - Southeast","KENTUCKY","KY","LEXINGTON",2,"Row House",81768.53,143094.94,107075.2,187381.61,129675.57,226932.26,158585.93,277525.37,188087.24,329152.65999999997,207240.25,362670.44,225133.7,393983.97]
[4,2022,"Region IV - Southeast","KENTUCKY","KY","LEXINGTON",3,"Walkup",78177.95,136811.41,106614.44,186575.27,135009.57999999999,236266.76,177959.47,311429.08,220524.37,385917.65,248473.21,434828.11,276079.82,483139.69]
[4,2022,"Region IV - Southeast","KENTUCKY","KY","LEXINGTON",4,"Elevator",83844.350000000006,134150.96,117382.09,187811.35,150919.82999999999,241471.74,201226.44,321962.32,251533.06,402452.89,285070.8,456113.28,318608.53999999998,509773.67]
[4,2022,"Region IV - Southeast","KENTUCKY","KY","LOUISVILLE",1,"Detached/Semi-Detached",103365.7,180889.98,134017.39000000001,234530.43,160097.88,280171.28000000003,190735.56,333787.23,224433.55,392758.71,246056.12,430598.22,266937.59999999998,467140.79]
[4,2022,"Region IV - Southeast","KENTUCKY","KY","LOUISVILLE",2,"Row House",81575.649999999994,142757.39000000001,106753.52,186818.66,129212.88,226122.54,157889.88,276307.28999999998,187199.37,327598.90000000002,206223.52,360891.16,223984.28,391972.49]
[4,2022,"Region IV - Southeast","KENTUCKY","KY","LOUISVILLE",3,"Walkup",78236.73,136914.28,106755.18,186821.56,135233.13,236657.98,178299.88,312024.78999999998,220989.58,386731.76,249030.42,435803.24,276736.11,484288.19]
[4,2022,"Region IV - Southeast","KENTUCKY","KY","LOUISVILLE",4,"Elevator",83486.570000000007,133578.51999999999,116881.2,187009.92000000001,150275.82999999999,240441.33,200367.77,320588.44,250459.71,400735.55,283854.34000000003,454166.95,317248.96999999997,507598.36]
[4,2022,"Region IV - Southeast","KENTUCKY","KY","OWENSBORO",1,"Detached/Semi-Detached",102365.26,179139.20000000001,132789.88,232382.29,158690.31,277708.05,189143.1,331000.43,222613.27,389573.22,244091.3,427159.78,264862.11,463508.7]
[4,2022,"Region IV - Southeast","KENTUCKY","KY","OWENSBORO",2,"Row House",80345.83,140605.21,105239.02,184168.29,127480.21,223090.38,155951.67999999999,272915.43,184987.15,323727.51,203839.41,356718.97,221456.66,387549.15]
[4,2022,"Region IV - Southeast","KENTUCKY","KY","OWENSBORO",3,"Walkup",76723.289999999994,134265.76,104607.14,183062.5,132450.07,231787.62,174567.97,305493.94,216304.84,378533.46,243706.06,426485.6,270768.59000000003,473845.03]
[4,2022,"Region IV - Southeast","KENTUCKY","KY","OWENSBORO",4,"Elevator",82447.66,131916.25,115426.72,184682.76,148405.78,237449.26,197874.38,316599.01,247342.97,395748.76,280322.03999999998,448515.26,313301.09999999998,501281.76]
[4,2022,"Region IV - Southeast","KENTUCKY","KY","PADUCAH",1,"Detached/Semi-Detached",101834.76,178210.82,132119.74,231209.55,157904.71,276333.24,188228.61,329400.07,221550.81,387713.91,242934.31,425135.05,263621.18,461337.07]
[4,2022,"Region IV - Southeast","KENTUCKY","KY","PADUCAH",2,"Row House",79815.33,139676.82999999999,104568.89,182995.55,126694.61,221715.57,155037.19,271315.08,183924.69,321868.2,202682.42,354694.24,220215.73,385377.52]
[4,2022,"Region IV - Southeast","KENTUCKY","KY","PADUCAH",3,"Walkup",76129.67,133226.93,103776.08,181608.14,131381.56,229917.73,173143.28,303000.74,214523.98,375416.97,241687.76,422953.57,268512.84000000003,469897.47]
[4,2022,"Region IV - Southeast","KENTUCKY","KY","PADUCAH",4,"Elevator",81960.539999999994,131136.85999999999,114744.75,183591.6,147528.97,236046.35,196705.29,314728.46000000002,245881.61,393410.58,278665.82,445865.32,311450.03999999998,498320.07]
[4,2022,"Region IV - Southeast","MISSISSIPPI","MS","BILOXI",1,"Detached/Semi-Detached",98818.880000000005,172933.05,128092.49,224161.86,152994.79999999999,267740.90000000002,182237.04,318914.82,214410.67,375218.67,235054.42,411345.23,254978.24,446211.93]
[4,2022,"Region IV - Southeast","MISSISSIPPI","MS","BILOXI",2,"Row House",78175.67,136807.43,102263.56,178961.24,123735.33,216536.83,151120.07999999999,264460.14,179136.18,313488.32,197318.27,345306.97,214285.63,374999.85]
[4,2022,"Region IV - Southeast","MISSISSIPPI","MS","BILOXI",3,"Walkup",75118.789999999994,131457.88,102536.18,179438.31,129915.2,227351.6,171315.15,299801.51,212357.89,371626.3,239322.81,418814.92,265970.21999999997,465447.88]
[4,2022,"Region IV - Southeast","MISSISSIPPI","MS","BILOXI",4,"Elevator",79912.960000000006,127860.73,111878.14,179005.03,143843.32,230149.32,191791.1,306865.76,239738.87,383582.2,271704.05,434726.49,303669.24,485870.78]
[4,2022,"Region IV - Southeast","MISSISSIPPI","MS","COLUMBUS",1,"Detached/Semi-Detached",91861.79,160758.12,119267.96,208718.93,142618.28,249581.99,170112.15,297696.26,200294.03,350514.56,219664.39,384412.68,238439.74,417269.54]
[4,2022,"Region IV - Southeast","MISSISSIPPI","MS","COLUMBUS",2,"Row House",71447.94,125033.9,93726.02,164020.53,113683.92,198946.86,139340.93,243846.64,165411.48000000001,289470.09999999998,182347.53,319108.18,198199.27,346848.72]
[4,2022,"Region IV - Southeast","MISSISSIPPI","MS","COLUMBUS",3,"Walkup",67727.94,118523.9,92218.22,161381.89000000001,116670.56,204173.48,153676.79,268934.39,190329.79,333077.13,214372.63,375152.1,238101.47,416677.58]
[4,2022,"Region IV - Southeast","MISSISSIPPI","MS","COLUMBUS",4,"Elevator",73645.05,117832.08,103103.07,164964.91,132561.09,212097.74,176748.12,282796.99,220935.15,353496.24,250393.17,400629.07,279851.19,447761.9]
[4,2022,"Region IV - Southeast","MISSISSIPPI","MS","GREENVILLE",1,"Detached/Semi-Detached",96287.49,168503.11,124967.34,218692.84,149394.07,261439.62,178137.64,311740.86,209707.65,366988.38,229967.79,402443.63,249586.34,436776.1]
[4,2022,"Region IV - Southeast","MISSISSIPPI","MS","GREENVILLE",2,"Row House",75185.539999999994,131574.70000000001,98564.43,172487.76,119484.39,209097.68,146329.19,256076.08,173649.28,303886.24,191393.06,334937.84999999998,207989.45,363981.54]
[4,2022,"Region IV - Southeast","MISSISSIPPI","MS","GREENVILLE",3,"Walkup",71498.289999999994,125122.01,97409.04,170465.82,123280.56,215740.99,162426.63,284246.59999999998,201207.55,352113.21,226655.77,396647.6,251779.42,440613.99]
[4,2022,"Region IV - Southeast","MISSISSIPPI","MS","GREENVILLE",4,"Elevator",77348.009999999995,123756.82,108287.21,173259.54,139226.42000000001,222762.27,185635.22,297016.36,232044.03,371270.45,262983.23,420773.17,293922.43,470275.9]
[4,2022,"Region IV - Southeast","MISSISSIPPI","MS","JACKSON",1,"Detached/Semi-Detached",98227.82,171898.69,127309.6,222791.79,152045.54999999999,266079.71000000002,181086.03,316900.56,213043.57,372826.25,233548.27,408709.48,253330.93,443329.13]
[4,2022,"Region IV - Southeast","MISSISSIPPI","MS","JACKSON",2,"Row House",77813.98,136174.47,101767.66,178093.4,123111.18,215444.57,150314.82,263050.93,178161.02,311781.78999999998,196231.41,343404.97,213090.46,372908.3]
[4,2022,"Region IV - Southeast","MISSISSIPPI","MS","JACKSON",3,"Walkup",74851.37,130989.9,102191.02,178834.28,129492.72,226612.27,170773.01,298852.77,211700.06,370475.11,238592.27,417536.47,265170.49,464048.35]
[4,2022,"Region IV - Southeast","MISSISSIPPI","MS","JACKSON",4,"Elevator",79490.509999999995,127184.81,111286.71,178058.74,143082.91,228932.66,190777.22,305243.55,238471.52,381554.44,270267.71999999997,432428.37,302063.93,483302.29]
[4,2022,"Region IV - Southeast","MISSISSIPPI","MS","LAUREL",1,"Detached/Semi-Detached",93453.29,163543.26,121278.37,212237.14,144975.09,253706.42,172855.62,302497.33,203481.41,356092.48,223135.35999999999,390486.87,242162.53,423784.44]
[4,2022,"Region IV - Southeast","MISSISSIPPI","MS","LAUREL",2,"Row House",73039.45,127819.04,95736.43,167538.75,116040.73,203071.28,142084.4,248647.7,168598.87,295048.01,185818.5,325182.37,201922.06,353363.61]
[4,2022,"Region IV - Southeast","MISSISSIPPI","MS","LAUREL",3,"Walkup",69508.800000000003,121640.4,94711.42,165744.98000000001,119876.1,209783.17,157950.84,276413.98,195672.35,342426.61,220427.53,385748.18,244868.72,428520.26]
[4,2022,"Region IV - Southeast","MISSISSIPPI","MS","LAUREL",4,"Elevator",75106.41,120170.26,105148.98,168238.37,135191.54,216306.47,180255.39,288408.63,225319.24,360510.78,255361.8,408578.89,285404.37,456646.99]
[4,2022,"Region IV - Southeast","MISSISSIPPI","MS","MERIDIAN",1,"Detached/Semi-Detached",95696.43,167468.75,124184.44,217322.77,148444.82,259778.43,176986.63,309726.59999999998,208340.55,364595.96,228461.64,399807.88,247939.03,433893.31]
[4,2022,"Region IV - Southeast","MISSISSIPPI","MS","MERIDIAN",2,"Row House",74823.850000000006,130941.73,98068.52,171619.91,118860.24,208005.43,145523.92000000001,254666.86,172674.12,302179.71000000002,190306.2,333035.84999999998,206794.28,361889.99]
[4,2022,"Region IV - Southeast","MISSISSIPPI","MS","MERIDIAN",3,"Walkup",71230.880000000005,124654.03,97063.88,169861.79,122858.09,215001.65,161884.49,283297.87,200549.72,350962.01,225925.23,395369.16,250979.69,439214.46]
[4,2022,"Region IV - Southeast","MISSISSIPPI","MS","MERIDIAN",4,"Elevator",76925.56,123080.9,107695.78,172313.25,138466.01,221545.61,184621.34,295394.15000000002,230776.68,369242.69,261546.9,418475.05,292317.12,467707.4]
[4,2022,"Region IV - Southeast","MISSISSIPPI","MS","TUPELO",1,"Detached/Semi-Detached",90740.22,158795.39000000001,117814.93,206176.12,140883.42000000001,246545.99,168046.65,294081.64,197864.47,346262.83,217001.25,379752.2,235551.5,412215.12]
[4,2022,"Region IV - Southeast","MISSISSIPPI","MS","TUPELO",2,"Row House",70555.75,123472.56,92559.98,161979.96,112274.17,196479.79,137621.18,240837.07,163373.85999999999,285904.26,180103.69,315181.45,195763.16,342585.54]
[4,2022,"Region IV - Southeast","MISSISSIPPI","MS","TUPELO",3,"Walkup",66866.91,117017.09,91042,159323.49,115179.57,201564.25,151709.97,265492.46000000002,187891.11,328809.44,211623.78,370341.62,235046,411330.49]
[4,2022,"Region IV - Southeast","MISSISSIPPI","MS","TUPELO",4,"Elevator",72735.48,116376.77,101829.67,162927.47,130923.86,209478.18,174565.15,279304.24,218206.43,349130.3,247300.63,395681.01,276394.82,442231.71]
[4,2022,"Region IV - Southeast","NORTH CAROLINA","NC","ASHEVILLE",1,"Detached/Semi-Detached",107079.22,187388.64,138708.34,242739.6,165597.10999999999,289794.95,197136.99,344989.73,231870.78,405773.86,254155.06,444771.35,275624.13,482342.22]
[4,2022,"Region IV - Southeast","NORTH CAROLINA","NC","ASHEVILLE",2,"Row House",85289.17,149256.04999999999,111444.47,195027.83,134712.12,235746.21,164291.31,287509.78999999998,194636.6,340614.04,214322.45,375064.29,232670.81,407173.92]
[4,2022,"Region IV - Southeast","NORTH CAROLINA","NC","ASHEVILLE",3,"Walkup",82392.06,144186.10999999999,112572.64,197002.12,142712.73000000001,249747.27,188272.67,329477.18,233455.57,408547.24,263158.55,460527.46,292526.37,511921.14]
[4,2022,"Region IV - Southeast","NORTH CAROLINA","NC","ASHEVILLE",4,"Elevator",86896.42,139034.28,121654.99,194647.99,156413.56,250261.7,208551.41,333682.26,260689.26,417102.83,295447.83,472716.54,330206.40000000002,528330.25]
[4,2022,"Region IV - Southeast","NORTH CAROLINA","NC","CHARLOTTE",1,"Detached/Semi-Detached",107428.05,187999.09,139040.20000000001,243320.35,165891.78,290310.62,197341.92,345348.37,232019.33,406033.83,254264.58,444963.02,275645.93,482380.38]
[4,2022,"Region IV - Southeast","NORTH CAROLINA","NC","CHARLOTTE",2,"Row House",86326.1,151070.68,112637.29,197115.26,135982.1,237968.68,165533.47,289683.58,195960.95999999999,342931.69,215689.85,377457.24,234049.03,409585.81]
[4,2022,"Region IV - Southeast","NORTH CAROLINA","NC","CHARLOTTE",3,"Walkup",83964.28,146937.5,114861.43,201007.5,145719.35,255008.86,192345.01,336603.77,238605.52,417559.67,269040.15000000002,470820.25,299150.19,523512.84]
[4,2022,"Region IV - Southeast","NORTH CAROLINA","NC","CHARLOTTE",4,"Elevator",87577.56,140124.1,122608.58,196173.74,157639.60999999999,252223.37,210186.14,336297.83,262732.68,420372.29,297763.7,476421.93,332794.73,532471.56999999995]
[4,2022,"Region IV - Southeast","NORTH CAROLINA","NC","DURHAM",1,"Detached/Semi-Detached",108079.67,189139.43,139935.85999999999,244887.75,167004.68,292258.19,198729.45,347776.54,233691.07,408959.37,256119.88,448209.8,277699.62,485974.33]
[4,2022,"Region IV - Southeast","NORTH CAROLINA","NC","DURHAM",2,"Row House",86518.99,151408.23000000001,112958.97,197678.2,136444.79,238778.39,166229.51999999999,290901.65000000002,196848.82,344485.44,216706.57,379236.5,235198.44,411597.27]
[4,2022,"Region IV - Southeast","NORTH CAROLINA","NC","DURHAM",3,"Walkup",83905.5,146834.63,114720.68,200761.2,145495.79,254617.64,192004.6,336008.05,238140.32,416745.56,268482.92,469845.12,298493.90000000002,522364.32]
[4,2022,"Region IV - Southeast","NORTH CAROLINA","NC","DURHAM",4,"Elevator",87935.34,140696.54,123109.47,196975.16,158283.60999999999,253253.78,211044.81,337671.7,263806.01,422089.63,298980.15000000002,478368.24,334154.28000000003,534646.86]
[4,2022,"Region IV - Southeast","NORTH CAROLINA","NC","FAYETTEVILLE",1,"Detached/Semi-Detached",104184.47,182322.83,134906.62,236086.58,161014.5,281775.38,191618.46,335332.31,225339.92,394344.87,246973.48,432203.6,267793.95,468639.42]
[4,2022,"Region IV - Southeast","NORTH CAROLINA","NC","FAYETTEVILLE",2,"Row House",83311.89,145795.82,108790.7,190383.73,131429.93,230002.37,160155.76,280272.58,189673.5,331928.62,208818.04,365431.57,226649.2,396636.1]
[4,2022,"Region IV - Southeast","NORTH CAROLINA","NC","FAYETTEVILLE",3,"Walkup",80728.77,141275.35,110360.93,193131.64,139954.29999999999,244920.03,184679.45,323189.03999999998,229043.42,400825.98,258218.08,451881.65,287071.7,502375.48]
[4,2022,"Region IV - Southeast","NORTH CAROLINA","NC","FAYETTEVILLE",4,"Elevator",84719.5,135551.20000000001,118607.3,189771.69,152495.1,243992.17,203326.8,325322.89,254158.5,406653.61,288046.3,460874.09,321934.11,515094.58]
[4,2022,"Region IV - Southeast","NORTH CAROLINA","NC","GASTONIA",1,"Detached/Semi-Detached",108019.11,189033.45,139823.09,244690.42,166841.03,291971.81,198492.93,347362.63,233386.43,408426.25,255770.73,447598.77,277293.24,485263.17]
[4,2022,"Region IV - Southeast","NORTH CAROLINA","NC","GASTONIA",2,"Row House",86687.8,151703.64000000001,113133.2,197983.1,136606.25,239060.94,166338.74,291092.78999999998,196936.12,344638.22,216776.71,379359.23,235244.2,411677.36]
[4,2022,"Region IV - Southeast","NORTH CAROLINA","NC","GASTONIA",3,"Walkup",84231.7,147405.48000000001,115206.59,201611.53,146141.82999999999,255748.2,192887.15,337552.51,239263.35,418710.86,269770.69,472098.7,299949.92,524912.36]
[4,2022,"Region IV - Southeast","NORTH CAROLINA","NC","GASTONIA",4,"Elevator",88000.01,140800.01999999999,123200.01,197120.02,158400.01999999999,253440.03,211200.02,337920.04,264000.03000000003,422400.05,299200.03000000003,478720.06,334400.03000000003,535040.06000000006]
[4,2022,"Region IV - Southeast","NORTH CAROLINA","NC","GREENSBORO",1,"Detached/Semi-Detached",107488.61,188105.07,139152.95999999999,243517.68,166055.43,290597,197578.44,345762.28,232323.97,406566.94,254613.74,445574.04,276052.31,483091.54]
[4,2022,"Region IV - Southeast","NORTH CAROLINA","NC","GREENSBORO",2,"Row House",86157.29,150775.26,112463.06,196810.36,135820.65,237686.13,165424.25,289492.44,195873.66,342778.91,215619.72,377334.5,234003.27,409505.73]
[4,2022,"Region IV - Southeast","NORTH CAROLINA","NC","GREENSBORO",3,"Walkup",83638.080000000002,146366.65,114375.52,200157.16,145073.32,253878.3,191462.46,335059.31,237482.49,415594.36,267752.38,468566.67,297694.17,520964.8]
[4,2022,"Region IV - Southeast","NORTH CAROLINA","NC","GREENSBORO",4,"Elevator",87512.89,140020.62,122518.04,196028.87,157523.20000000001,252037.12,210030.93,336049.49,262538.65999999997,420061.87,297543.82,476070.12,332548.96999999997,532078.37]
[4,2022,"Region IV - Southeast","NORTH CAROLINA","NC","HICKORY",1,"Detached/Semi-Detached",103593.41,181288.47,134123.72,234716.51,160065.25,280114.18,190467.45,333318.03000000003,223972.82,391952.43,245467.33,429567.82,266146.63,465756.61]
[4,2022,"Region IV - Southeast","NORTH CAROLINA","NC","HICKORY",2,"Row House",82950.2,145162.85,108294.79,189515.88,130805.78,228910.11,159350.49,278863.34999999998,188698.33,330222.08000000002,207731.18,363529.56,225454.02,394544.54]
[4,2022,"Region IV - Southeast","NORTH CAROLINA","NC","HICKORY",3,"Walkup",80461.350000000006,140807.37,110015.77,192527.6,139531.82,244180.69,184137.31,322240.28999999998,228385.59,399674.78,257487.54,450603.19,286271.96999999997,500975.95]
[4,2022,"Region IV - Southeast","NORTH CAROLINA","NC","HICKORY",4,"Elevator",84297.05,134875.28,118015.87,188825.39,151734.69,242775.51,202312.92,323700.67,252891.15,404625.84,286609.96999999997,458575.95,320328.78999999998,512526.07]
[4,2022,"Region IV - Southeast","NORTH CAROLINA","NC","RALEIGH",1,"Detached/Semi-Detached",107549.17,188211.05,139265.72,243715.01,166219.07999999999,290883.38,197814.96,346176.19,232628.61,407100.06,254962.9,446185.07,276458.69,483802.7]
[4,2022,"Region IV - Southeast","NORTH CAROLINA","NC","RALEIGH",2,"Row House",85988.479999999996,150479.85,112288.84,196505.47,135659.19,237403.58,165315.03,289301.3,195786.36,342626.14,215549.58,377211.77,233957.51,409425.64]
[4,2022,"Region IV - Southeast","NORTH CAROLINA","NC","RALEIGH",3,"Walkup",83311.88,145795.79999999999,113889.62,199306.83,144427.28,252747.74,190579.91,333514.84999999998,236359.46,413629.06,266464.62,466313.09,296238.15000000002,518416.76]
[4,2022,"Region IV - Southeast","NORTH CAROLINA","NC","RALEIGH",4,"Elevator",87448.22,139917.15,122427.5,195884.01,157406.79,251850.87,209875.72,335801.16,262344.65000000002,419751.45,297323.94,475718.3,332303.21999999997,531685.16]
[4,2022,"Region IV - Southeast","NORTH CAROLINA","NC","ROCKY MOUNT",1,"Detached/Semi-Detached",103653.97,181394.45,134236.48000000001,234913.85,160228.9,280400.57,190703.97,333731.96000000002,224277.46,392485.56,245816.49,430178.86,266553.02,466467.79]
[4,2022,"Region IV - Southeast","NORTH CAROLINA","NC","ROCKY MOUNT",2,"Row House",82781.39,144867.44,108120.56,189210.99,130644.32,228627.57,159241.26999999999,278672.21999999997,188611.04,330069.31,207661.05,363406.84,225408.27,394464.47]
[4,2022,"Region IV - Southeast","NORTH CAROLINA","NC","ROCKY MOUNT",3,"Walkup",80135.149999999994,140236.51999999999,109529.87,191677.27,138885.79,243050.13,183254.77,320695.84000000003,227262.56,397709.48,256199.78,448349.62,284815.96000000002,498427.92]
[4,2022,"Region IV - Southeast","NORTH CAROLINA","NC","ROCKY MOUNT",4,"Elevator",84232.38,134771.81,117925.33,188680.53,151618.28,242589.26,202157.71,323452.34999999998,252697.14,404315.43,286390.09000000003,458224.16,320083.05,512132.88]
[4,2022,"Region IV - Southeast","NORTH CAROLINA","NC","WILMINGTON",1,"Detached/Semi-Detached",104775.54,183357.19,135689.51999999999,237456.65,161963.75,283436.57,192769.47,337346.58,226707.02,396737.29,248479.63,434839.35,269441.26,471522.21]
[4,2022,"Region IV - Southeast","NORTH CAROLINA","NC","WILMINGTON",2,"Row House",83673.59,146428.78,109286.61,191251.57,132054.07999999999,231094.63,160961.01999999999,281681.78999999998,190648.66,333635.15000000002,209904.9,367333.57,227844.37,398727.65]
[4,2022,"Region IV - Southeast","NORTH CAROLINA","NC","WILMINGTON",3,"Walkup",80996.19,141743.32999999999,110706.1,193735.67,140376.78,245659.37,185221.58,324137.77,229701.24,401977.17,258948.62,453160.09,287871.43,503775.01]
[4,2022,"Region IV - Southeast","NORTH CAROLINA","NC","WILMINGTON",4,"Elevator",85141.95,136227.12,119198.73,190717.97,153255.51,245208.82,204340.68,326945.09999999998,255425.85,408681.37,289482.63,463172.22,323539.40999999997,517663.07]
[4,2022,"Region IV - Southeast","NORTH CAROLINA","NC","WINSTON-SALEM",1,"Detached/Semi-Detached",105124.36,183967.63,136021.37,238037.39,162258.42000000001,283952.23,192974.4,337705.2,226855.56,396997.24,248589.15,435031.01,269463.06,471560.35]
[4,2022,"Region IV - Southeast","NORTH CAROLINA","NC","WINSTON-SALEM",2,"Row House",84710.52,148243.41,110479.43,193339,133324.04999999999,233317.1,162203.18,283855.57,191973.02,335952.78,211272.29,369726.5,229222.58,401139.52]
[4,2022,"Region IV - Southeast","NORTH CAROLINA","NC","WINSTON-SALEM",3,"Walkup",82568.41,144494.72,112994.88,197741.04,143383.4,250920.95,189293.92,331264.36,234851.19,410989.59,264830.21999999997,463452.88,294495.25,515366.69]
[4,2022,"Region IV - Southeast","NORTH CAROLINA","NC","WINSTON-SALEM",4,"Elevator",85823.09,137316.94,120152.32000000001,192243.72,154481.56,247170.49,205975.41,329560.65999999997,257469.26,411950.82,291798.49,466877.6,326127.73,521804.37]
[4,2022,"Region IV - Southeast","SOUTH CAROLINA","SC","CHARLESTON",1,"Detached/Semi-Detached",106958.11,187176.69,138482.82,242344.94,165269.82999999999,289222.19,196663.95,344161.92,231261.51,404707.64,253456.75,443549.31,274811.38,480919.91]
[4,2022,"Region IV - Southeast","SOUTH CAROLINA","SC","CHARLESTON",2,"Row House",85626.79,149846.88,111792.93,195637.63,135035.04,236311.32,164509.76000000001,287892.08,194811.2,340919.61,214462.73,375309.77,232762.34,407334.1]
[4,2022,"Region IV - Southeast","SOUTH CAROLINA","SC","CHARLESTON",3,"Walkup",83044.47,145327.81,113544.46,198702.8,144004.79999999999,252008.4,190037.78,332566.11,235701.64,412477.87,265734.08,465034.64,295438.42,517017.24]
[4,2022,"Region IV - Southeast","SOUTH CAROLINA","SC","CHARLESTON",4,"Elevator",87025.77,139241.23000000001,121836.07,194937.72,156646.38,250634.21,208861.84,334178.95,261077.3,417723.69,295887.61,473420.18,330697.90999999997,529116.67000000004]
[4,2022,"Region IV - Southeast","SOUTH CAROLINA","SC","COLUMBIA",1,"Detached/Semi-Detached",104593.86,183039.25,135351.23000000001,236864.65,161472.81,282577.42,192059.91,336104.85,225793.1,395137.93,247432.16,433006.27,268222.13,469388.72]
[4,2022,"Region IV - Southeast","SOUTH CAROLINA","SC","COLUMBIA",2,"Row House",84180.02,147315.03,109809.29,192166.26,132538.45000000001,231942.29,161288.70000000001,282255.21999999997,190910.56,334093.46999999997,210115.3,367701.77,227981.65,398967.89]
[4,2022,"Region IV - Southeast","SOUTH CAROLINA","SC","COLUMBIA",3,"Walkup",81974.8,143455.89000000001,112163.81,196286.67,142314.89000000001,249051.06,187869.23,328771.15999999997,233070.34,407873.09,262811.92,459920.85,292239.5,511419.13]
[4,2022,"Region IV - Southeast","SOUTH CAROLINA","SC","COLUMBIA",4,"Elevator",85335.97,136537.54999999999,119470.35,191152.57,153604.74,245767.58,204806.32,327690.11,256007.9,409612.64,290142.28000000003,464227.66,324276.67,518842.68]
[4,2022,"Region IV - Southeast","SOUTH CAROLINA","SC","FLORENCE",1,"Detached/Semi-Detached",99819.33,174683.83,129320,226310.01,154402.35999999999,270204.13,183829.5,321701.62,216230.95,378404.16,237019.24,414783.67,257053.73,449844.02]
[4,2022,"Region IV - Southeast","SOUTH CAROLINA","SC","FLORENCE",2,"Row House",79405.490000000005,138959.6,103778.06,181611.61,125468,219569,153058.28,267851.99,181348.4,317359.7,199702.38,349479.17,216813.25,379423.2]
[4,2022,"Region IV - Southeast","SOUTH CAROLINA","SC","FLORENCE",3,"Walkup",76632.22,134106.39000000001,104684.21,183197.37,132698.26,232221.96,175047.06,306332.36,217042.63,379824.6,244647.18,428132.56,271937.74,475891.04]
[4,2022,"Region IV - Southeast","SOUTH CAROLINA","SC","FLORENCE",4,"Elevator",80951.87,129522.99,113332.62,181332.19,145713.37,233141.39,194284.49,310855.19,242855.61,388568.98,275236.36,440378.18,307617.11,492187.38]
[4,2022,"Region IV - Southeast","SOUTH CAROLINA","SC","GREENVILLE",1,"Detached/Semi-Detached",105366.6,184391.55,136472.41,238826.72,162913.01,285097.76,193920.48,339360.84,228074.12,399129.71,249985.77,437475.11,271088.57,474405]
[4,2022,"Region IV - Southeast","SOUTH CAROLINA","SC","GREENVILLE",2,"Row House",84035.28,147061.74,109782.52,192119.41,132678.22,232186.89,161766.29,283091.01,191623.82,335341.68,210991.75,369235.57,229039.54,400819.19]
[4,2022,"Region IV - Southeast","SOUTH CAROLINA","SC","GREENVILLE",3,"Walkup",81263.61,142211.31,111051.26,194339.7,140799.26,246398.7,185763.72,325086.51,230359.07,403128.36,259679.17,454438.54,288671.15999999997,505174.53]
[4,2022,"Region IV - Southeast","SOUTH CAROLINA","SC","GREENVILLE",4,"Elevator",85564.4,136903.04000000001,119790.16,191664.26,154015.92000000001,246425.48,205354.56,328567.3,256693.2,410709.13,290918.96000000002,465470.35,325144.71999999997,520231.56]
[4,2022,"Region IV - Southeast","SOUTH CAROLINA","SC","ROCK HILL",1,"Detached/Semi-Detached",103653.97,181394.45,134236.48000000001,234913.85,160228.9,280400.57,190703.97,333731.96000000002,224277.46,392485.56,245816.49,430178.86,266553.02,466467.79]
[4,2022,"Region IV - Southeast","SOUTH CAROLINA","SC","ROCK HILL",2,"Row House",82781.39,144867.44,108120.56,189210.99,130644.32,228627.57,159241.26999999999,278672.21999999997,188611.04,330069.31,207661.05,363406.84,225408.27,394464.47]
[4,2022,"Region IV - Southeast","SOUTH CAROLINA","SC","ROCK HILL",3,"Walkup",80135.149999999994,140236.51999999999,109529.87,191677.27,138885.79,243050.13,183254.77,320695.84000000003,227262.56,397709.48,256199.78,448349.62,284815.96000000002,498427.92]
[4,2022,"Region IV - Southeast","SOUTH CAROLINA","SC","ROCK HILL",4,"Elevator",84232.38,134771.81,117925.33,188680.53,151618.28,242589.26,202157.71,323452.34999999998,252697.14,404315.43,286390.09000000003,458224.16,320083.05,512132.88]
[4,2022,"Region IV - Southeast","SOUTH CAROLINA","SC","SPARTANBURG",1,"Detached/Semi-Detached",104714.98,183251.21,135576.75,237259.32,161800.10999999999,283150.19,192532.95,336932.67,226402.38,396204.17,248130.47,434228.33,269034.89,470811.05]
[4,2022,"Region IV - Southeast","SOUTH CAROLINA","SC","SPARTANBURG",2,"Row House",83842.399999999994,146724.19,109460.84,191556.46,132215.53,231377.18,161070.25,281872.93,190735.96,333787.92,209975.03,367456.3,227890.13,398807.73]
[4,2022,"Region IV - Southeast","SOUTH CAROLINA","SC","SPARTANBURG",3,"Walkup",81322.39,142314.18,111192,194586,141022.82,246789.93,186104.13,325682.23,230824.27,403942.47,260236.39,455413.68,289327.45,506323.04]
[4,2022,"Region IV - Southeast","SOUTH CAROLINA","SC","SPARTANBURG",4,"Elevator",85206.62,136330.6,119289.27,190862.84,153371.92000000001,245395.08,204495.89,327193.44,255619.87,408991.79,289702.52,463524.03,323785.17,518056.27]
[4,2022,"Region IV - Southeast","TENNESSEE","TN","CHATTANOOGA",1,"Detached/Semi-Detached",100001.01,175001.77,129658.29,226902.01,154893.31,271063.28999999998,184539.07,322943.35999999999,217144.87,380003.53,238066.72,416616.76,258272.87,451977.53]
[4,2022,"Region IV - Southeast","TENNESSEE","TN","CHATTANOOGA",2,"Row House",78899.06,138073.35999999999,103255.38,180696.92,124983.63,218721.35,152730.62,267278.58,181086.51,316901.39,199491.99,349110.98,216675.98,379182.96]
[4,2022,"Region IV - Southeast","TENNESSEE","TN","CHATTANOOGA",3,"Walkup",75653.62,132393.84,103226.5,180646.38,130760.16,228830.28,172399.42,301698.99,213673.54,373928.69,240783.9,421371.82,267569.68,468246.94]
[4,2022,"Region IV - Southeast","TENNESSEE","TN","CHATTANOOGA",4,"Elevator",80757.86,129212.58,113061,180897.61,145364.15,232582.64,193818.86,310110.18,242273.58,387637.73,274576.71999999997,439322.76,306879.86,491007.79]
[4,2022,"Region IV - Southeast","TENNESSEE","TN","COLUMBIA",1,"Detached/Semi-Detached",91801.23,160652.14000000001,119155.2,208521.60000000001,142454.63,249295.61,169875.63,297282.34999999998,199989.4,349981.44,219315.23,383801.66,238033.36,416558.38]
[4,2022,"Region IV - Southeast","TENNESSEE","TN","COLUMBIA",2,"Row House",71616.75,125329.32,93900.25,164325.43,113845.38,199229.41,139450.16,244037.78,165498.78,289622.87,182417.66,319230.90999999997,198245.03,346928.8]
[4,2022,"Region IV - Southeast","TENNESSEE","TN","COLUMBIA",3,"Walkup",68054.149999999994,119094.76,92704.13,162232.22,117316.59,205304.04,154559.34,270478.84999999998,191452.82,335042.43,215660.39,377405.68,239557.49,419225.61]
[4,2022,"Region IV - Southeast","TENNESSEE","TN","COLUMBIA",4,"Elevator",73709.72,117935.55,103193.61,165109.78,132677.5,212284,176903.33,283045.33,221129.16,353806.66,250613.05,400980.88,280096.94,448155.11]
[4,2022,"Region IV - Southeast","TENNESSEE","TN","JACKSON",1,"Detached/Semi-Detached",97227.37,170147.9,126082.08,220643.64,150637.98000000001,263616.46000000002,179493.57,314113.74,211223.28,369640.74,231583.44,405271.03,251255.44,439697.02]
[4,2022,"Region IV - Southeast","TENNESSEE","TN","JACKSON",2,"Row House",76584.160000000003,134022.29,100253.15,175443.02,121378.51,212412.4,148376.60999999999,259659.06,175948.79,307910.39,193847.3,339232.77,210562.83,368484.95]
[4,2022,"Region IV - Southeast","TENNESSEE","TN","JACKSON",3,"Walkup",73337.929999999993,128341.38,100042.98,175075.21,126709.66,221741.9,167041.09,292321.90999999997,207015.31,362276.8,233267.89,408218.81,259202.96,453605.17]
[4,2022,"Region IV - Southeast","TENNESSEE","TN","JACKSON",4,"Elevator",78451.59,125522.55,109832.23,175731.57,141212.85999999999,225940.58,188283.82,301254.11,235354.77,376567.64,266735.40999999997,426776.66,298116.05,476985.68]
[4,2022,"Region IV - Southeast","TENNESSEE","TN","JOHNSON CITY",1,"Detached/Semi-Detached",91801.23,160652.14000000001,119155.2,208521.60000000001,142454.63,249295.61,169875.63,297282.34999999998,199989.4,349981.44,219315.23,383801.66,238033.36,416558.38]
[4,2022,"Region IV - Southeast","TENNESSEE","TN","JOHNSON CITY",2,"Row House",71616.75,125329.32,93900.25,164325.43,113845.38,199229.41,139450.16,244037.78,165498.78,289622.87,182417.66,319230.90999999997,198245.03,346928.8]
[4,2022,"Region IV - Southeast","TENNESSEE","TN","JOHNSON CITY",3,"Walkup",68054.149999999994,119094.76,92704.13,162232.22,117316.59,205304.04,154559.34,270478.84999999998,191452.82,335042.43,215660.39,377405.68,239557.49,419225.61]
[4,2022,"Region IV - Southeast","TENNESSEE","TN","JOHNSON CITY",4,"Elevator",73709.72,117935.55,103193.61,165109.78,132677.5,212284,176903.33,283045.33,221129.16,353806.66,250613.05,400980.88,280096.94,448155.11]
[4,2022,"Region IV - Southeast","TENNESSEE","TN","KNOXVILLE",1,"Detached/Semi-Detached",97818.44,171182.27,126864.98,222013.72,151587.24,265277.65999999997,180644.58,316128.02,212590.39,372033.18,233089.6,407906.8,252902.76,442579.83]
[4,2022,"Region IV - Southeast","TENNESSEE","TN","KNOXVILLE",2,"Row House",76945.86,134655.25,100749.07,176310.86,122002.66,213504.66,149181.88,261068.29,176923.96,309616.93,194934.16,341134.78,211758.01,370576.51]
[4,2022,"Region IV - Southeast","TENNESSEE","TN","KNOXVILLE",3,"Walkup",73605.350000000006,128809.36,100388.14,175679.24,127132.14,222481.24,167583.23000000001,293270.65000000002,207673.14,363428,233998.44,409497.27,260002.69,455004.71]
[4,2022,"Region IV - Southeast","TENNESSEE","TN","KNOXVILLE",4,"Elevator",78874.039999999994,126198.47,110423.66,176677.86,141973.28,227157.25,189297.7,302876.33,236622.13,378595.41,268171.75,429074.8,299721.36,479554.19]
[4,2022,"Region IV - Southeast","TENNESSEE","TN","MEMPHIS",1,"Detached/Semi-Detached",101713.64,177998.86,131894.22,230814.89,157577.42000000001,275760.48,187755.57,328572.25,220941.53,386647.68,242236,423913,262808.42,459914.74]
[4,2022,"Region IV - Southeast","TENNESSEE","TN","MEMPHIS",2,"Row House",80152.95,140267.66,104917.34,183605.34,127017.53,222280.67,155255.64000000001,271697.36,184099.29,322173.75,202822.69,354939.7,220307.25,385537.69]
[4,2022,"Region IV - Southeast","TENNESSEE","TN","MEMPHIS",3,"Walkup",76782.080000000002,134368.63,104747.89,183308.79999999999,132673.63,232178.85,174908.38,306089.65999999997,216770.04,379347.57,244263.28,427460.74,271424.88,474993.55]
[4,2022,"Region IV - Southeast","TENNESSEE","TN","MEMPHIS",4,"Elevator",82089.88,131343.81,114925.83,183881.33,147761.78,236418.86,197015.71,315225.14,246269.64,394031.43,279105.59000000003,446568.95,311941.53999999998,499106.47]
[4,2022,"Region IV - Southeast","TENNESSEE","TN","NASHVILLE",1,"Detached/Semi-Detached",102123.02,178715.29,132338.82999999999,231592.95999999999,158035.73000000001,276562.52,188197.02,329344.78999999998,221394.71,387440.75,242694.68,424715.68,263236.59999999998,460664.05]
[4,2022,"Region IV - Southeast","TENNESSEE","TN","NASHVILLE",2,"Row House",81021.070000000007,141786.88,105935.93,185387.87,128126.05,224220.58,156388.57,273680,185336.35,324338.61,204119.94,357209.9,221639.7,387869.48]
[4,2022,"Region IV - Southeast","TENNESSEE","TN","NASHVILLE",3,"Walkup",78028.100000000006,136549.17000000001,106550.76,186463.84,135034.21,236309.87,178098.16,311671.78000000003,220796.96,386394.68,248857.1,435499.93,276592.67,484037.18]
[4,2022,"Region IV - Southeast","TENNESSEE","TN","NASHVILLE",4,"Elevator",82706.34,132330.15,115788.88,185262.21,148871.42000000001,238194.27,198495.22,317592.36,248119.03,396990.45,281201.57,449922.51,314284.09999999998,502854.57]
[5,2022,"Region V - Midwest","ILLINOIS","IL","BLOOMINGTON",1,"Detached/Semi-Detached",117272.29,205226.5,152242.20000000001,266423.86,182033.66,318558.90999999997,217105.11,379933.94,255611.42,447319.98,280323.88,490566.8,304270.13,532472.73]
[5,2022,"Region V - Midwest","ILLINOIS","IL","BLOOMINGTON",2,"Row House",91320.82,159811.44,119771.55,209600.21,145250.32999999999,254188.08,177986.65,311476.63,211266.35,369716.11,232884.15,407547.27,253113.7,442948.98]
[5,2022,"Region V - Midwest","ILLINOIS","IL","BLOOMINGTON",3,"Walkup",86650.16,151637.78,118003.78,206506.62,149309.17000000001,261291.05,196683.89,344196.8,243609.54,426316.69,274394.34999999998,480190.11,304779.99,533364.98]
[5,2022,"Region V - Midwest","ILLINOIS","IL","BLOOMINGTON",4,"Elevator",94073.75,150518.01,131703.25,210725.21,169332.75,270932.40999999997,225777,361243.21,282221.26,451554.02,319850.76,511761.22,357480.26,571968.42000000004]
[5,2022,"Region V - Midwest","ILLINOIS","IL","CARBONDALE",1,"Detached/Semi-Detached",114220.22,199885.39,148167.01999999999,259292.28,177065.63,309864.84999999998,211043.06,369325.36,248387.57,434678.25,272351.77,476615.59,295526.33,517171.07]
[5,2022,"Region V - Midwest","ILLINOIS","IL","CARBONDALE",2,"Row House",89659.02,156903.28,117435.86,205512.76,142252.84,248942.46,174020.23,304535.40999999997,206418.13,361231.73,227453.45,398043.54,247110.42,432443.24]
[5,2022,"Region V - Midwest","ILLINOIS","IL","CARBONDALE",3,"Walkup",85622.9,149840.07,116742.75,204299.81,147816.95000000001,258679.66,194822.56,340939.48,241403.16,422455.54,271984.67,475973.18,302188.39,528829.68999999994]
[5,2022,"Region V - Midwest","ILLINOIS","IL","CARBONDALE",4,"Elevator",92000.31,147200.49,128800.43,206080.69,165600.54999999999,264960.88,220800.73,353281.18,276000.92,441601.47,312801.03999999998,500481.67,349601.16,559361.87]
[5,2022,"Region V - Midwest","ILLINOIS","IL","CENTRALIA",1,"Detached/Semi-Detached",115811.73,202670.53,150177.43,262810.5,179422.45,313989.28000000003,213786.54,374126.44,251574.96,440256.18,275822.74,482689.8,299249.13,523685.98]
[5,2022,"Region V - Midwest","ILLINOIS","IL","CENTRALIA",2,"Row House",91250.53,159688.42000000001,119446.28,209030.98,144609.65,253066.89,176763.7,309336.48,209605.52,366809.66,230924.43,404117.74,250833.23,438958.15]
[5,2022,"Region V - Midwest","ILLINOIS","IL","CENTRALIA",3,"Walkup",87403.76,152956.57,119235.95,208662.91,151022.49,264289.36,199096.62,348419.08,246745.74,431805.04,278039.59000000003,486569.28,308955.65000000002,540672.4]
[5,2022,"Region V - Midwest","ILLINOIS","IL","CENTRALIA",4,"Elevator",93461.67,149538.68,130846.34,209354.15,168231.01,269169.62,224308.01,358892.82,280385.01,448616.03,317769.68,508431.5,355154.35,568246.97]
[5,2022,"Region V - Midwest","ILLINOIS","IL","CHAMPAIGN",1,"Detached/Semi-Detached",116475.42,203831.99,151089.07,264405.88,180554.73,315970.78000000003,215197.57,376595.74,253274.61,443230.57,277708.79999999999,485990.40000000002,301336.46000000002,527338.80000000005]
[5,2022,"Region V - Midwest","ILLINOIS","IL","CHAMPAIGN",2,"Row House",91450.8,160038.89000000001,119778.08,209611.65,145085.09,253898.9,177476.19,310583.33,210513.29,368398.26,231963.34,405935.85,252007.04000000001,441012.32]
[5,2022,"Region V - Midwest","ILLINOIS","IL","CHAMPAIGN",3,"Walkup",87350.43,152863.26,119102.25,208428.94,150807.56,263913.23,198767.28,347842.73,246293.97,431014.44,277497.28999999998,485620.25,308315.69,539552.46]
[5,2022,"Region V - Midwest","ILLINOIS","IL","CHAMPAIGN",4,"Elevator",93828.08,150124.92000000001,131359.31,210174.89,168890.54,270224.86,225187.38,360299.82,281484.23,450374.77,319015.46000000002,510424.74,356546.69,570474.71]
[5,2022,"Region V - Midwest","ILLINOIS","IL","CHICAGO",1,"Detached/Semi-Detached",137633.4,240858.45,178365.5,312139.62,213007.74,372763.54,253672.16,443926.28,298426.96999999997,522247.2,327142.32,572499.05000000005,354839.72,620969.51]
[5,2022,"Region V - Midwest","ILLINOIS","IL","CHICAGO",2,"Row House",109133.13,190982.98,142705.76,249735.09,172611.76,302070.57,210711.7,368745.48,249726.58,437021.51,275043.32,481325.82,298659,522653.24]
[5,2022,"Region V - Midwest","ILLINOIS","IL","CHICAGO",3,"Walkup",105055.86,183847.75,143447.01999999999,251032.29,181785.21,318124.12,239750.05,419562.59,297221.71999999997,520138.02,334988.21000000002,586229.36,372316.32,651553.55000000005]
[5,2022,"Region V - Midwest","ILLINOIS","IL","CHICAGO",4,"Elevator",111433.28,178293.26,156006.6,249610.56,200579.91,320927.86,267439.88,427903.81,334299.84999999998,534879.77,378873.16,606197.06999999995,423446.47,677514.37]
[5,2022,"Region V - Midwest","ILLINOIS","IL","DECATUR",1,"Detached/Semi-Detached",118000.34,206500.59,152978.73000000001,267712.78000000003,182738.21,319791.87,217692.77,380962.35,256143.4,448250.96,280815.24,491426.67,304636.06,533113.11]
[5,2022,"Region V - Midwest","ILLINOIS","IL","DECATUR",2,"Row House",93207.42,163112.99,121957.66,213425.9,147596.99,258294.73,180320.66,315561.15999999997,213778.02,374111.54,235493.35,412113.37,255763.4,447585.95]
[5,2022,"Region V - Midwest","ILLINOIS","IL","DECATUR",3,"Walkup",89454.76,156545.82999999999,122077.83,213636.21,154654.82,270645.94,203918.34,356857.1,252752.85,442317.48,284832.5,498456.87,316530.8,553928.9]
[5,2022,"Region V - Midwest","ILLINOIS","IL","DECATUR",4,"Elevator",95349.8,152559.67999999999,133489.72,213583.56,171629.64,274607.43,228839.52,366143.24,286049.40000000002,457679.05,324189.32,518702.92,362329.24,579726.79]
[5,2022,"Region V - Midwest","ILLINOIS","IL","EAST ST. LOUIS",1,"Detached/Semi-Detached",117603.02,205805.28,152550.09,266962.65999999997,182299.27,319023.73,217274.81,380230.92,255718.12,447506.71,280387.3,490677.78,304241.51,532422.64]
[5,2022,"Region V - Midwest","ILLINOIS","IL","EAST ST. LOUIS",2,"Row House",92346.68,161606.69,120949.19,211661.08,146501.21,256377.11,179204.16,313607.28000000003,212560.86,371981.51,234218.28,409881.98,254455.34,445296.84]
[5,2022,"Region V - Midwest","ILLINOIS","IL","EAST ST. LOUIS",3,"Walkup",88214.2,154374.85,120282,210493.5,152302.85999999999,266530.01,200739.63,351294.35,248739.36,435293.88,280253.58,490443.77,311379.33,544913.82999999996]
[5,2022,"Region V - Midwest","ILLINOIS","IL","EAST ST. LOUIS",4,"Elevator",94741.96,151587.13,132638.74,212221.99,170535.52,272856.84000000003,227380.7,363809.12,284225.87,454761.4,322122.65999999997,515396.26,360019.44,576031.11]
[5,2022,"Region V - Midwest","ILLINOIS","IL","GALESBURG",1,"Detached/Semi-Detached",115944.92,202903.61,150418.94,263233.14,179769.13,314595.96999999997,214283.08,374995.39,252212.15,441371.26,276551.81,483965.67,300095.52,525167.17000000004]
[5,2022,"Region V - Midwest","ILLINOIS","IL","GALESBURG",2,"Row House",90920.29,159110.51,119107.95,208438.91,144299.48000000001,252524.1,176561.7,308982.98,209450.83,366538.96,230806.35,403911.12,250766.11,438840.69]
[5,2022,"Region V - Midwest","ILLINOIS","IL","GALESBURG",3,"Walkup",86756.82,151824.43,118271.19,206974.58,149739.04999999999,262043.34,197342.59,345349.54,244513.11,427897.95,275478.98,482088.22,306059.94,535604.9]
[5,2022,"Region V - Midwest","ILLINOIS","IL","GALESBURG",4,"Elevator",93340.96,149345.53,130677.34,209083.74,168013.72,268821.96000000002,224018.29,358429.27,280022.87,448036.59,317359.25,507774.8,354695.63,567513.02]
[5,2022,"Region V - Midwest","ILLINOIS","IL","JOLIET",1,"Detached/Semi-Detached",134847.70000000001,235983.47,174773.31,305853.3,208733.04,365282.82,248603.18,435055.56,292477.48,511835.59,320628.3,561099.53,347788.67,608630.17000000004]
[5,2022,"Region V - Midwest","ILLINOIS","IL","JOLIET",2,"Row House",106810.85,186918.98,139693.41,244463.47,168993.9,295739.33,206341.26,361097.21,244568.95999999999,427995.69,269376.45,471408.79,292521.46000000002,511912.55]
[5,2022,"Region V - Midwest","ILLINOIS","IL","JOLIET",3,"Walkup",102734.71,179785.73,140256.45000000001,245448.79,177726.09,311020.65000000002,234380.65,410166.14,290550.06,508462.61,327457.28999999998,573050.25,363933.26,636883.21]
[5,2022,"Region V - Midwest","ILLINOIS","IL","JOLIET",4,"Elevator",109118.39,174589.43,152765.75,244425.2,196413.11,314260.98,261884.14,419014.64,327355.18,523768.29,371002.54,593604.06999999995,414649.89,663439.84]
[5,2022,"Region V - Midwest","ILLINOIS","IL","KANKAKEE",1,"Detached/Semi-Detached",131467.13,230067.47,170686.11,298700.69,204100.46,357175.81,243443.06,426025.36,286633.19,501608.08,314351.99,550115.99,341218.07,597131.63]
[5,2022,"Region V - Midwest","ILLINOIS","IL","KANKAKEE",2,"Row House",102271.73,178975.53,134156.62,234774.09,162719.21,284758.62,199434.79,349010.89,236744.98,414303.72,260982.3,456719.02,283667.09000000003,496417.41]
[5,2022,"Region V - Midwest","ILLINOIS","IL","KANKAKEE",3,"Walkup",96962.01,169683.52,132027.07,231047.37,167037.85999999999,292316.26,220022.77,385039.84,272502.46999999997,476879.33,306927.62,537123.32999999996,340903.69,596581.46]
[5,2022,"Region V - Midwest","ILLINOIS","IL","KANKAKEE",4,"Elevator",105406.74,168650.78,147569.43,236111.09,189732.13,303571.40999999997,252976.17,404761.87,316220.21000000002,505952.34,358382.9,573412.66,400545.6,640872.97]
[5,2022,"Region V - Midwest","ILLINOIS","IL","PEORIA",1,"Detached/Semi-Detached",119658.44,209402.27,155109.89000000001,271442.3,185268.36,324219.63,220684.5,386197.88,259649.37,454386.4,284650.73,498138.78,308782.05,540368.57999999996]
[5,2022,"Region V - Midwest","ILLINOIS","IL","PEORIA",2,"Row House",94633.81,165609.17000000001,123798.9,216648.07,149798.72,262147.75,182963.12,320185.46999999997,216888.05,379554.09,238905.28,418084.23,259452.63,454042.1]
[5,2022,"Region V - Midwest","ILLINOIS","IL","PEORIA",3,"Walkup",90912.14,159096.25,124088.65,217155.13,157218.64000000001,275132.62,207315.38,362801.91,256979.09,449713.41,289607.09999999998,506812.42,321850.19,563237.82999999996]
[5,2022,"Region V - Midwest","ILLINOIS","IL","PEORIA",4,"Elevator",96750.8,154801.29,135451.12,216721.8,174151.44,278642.32,232201.93,371523.09,290252.40999999997,464403.86,328952.73,526324.37,367653.05,588244.89]
[5,2022,"Region V - Midwest","ILLINOIS","IL","QUINCY",1,"Detached/Semi-Detached",119327.71,208823.49,154802,270903.5,185002.75,323754.82,220514.81,385900.91,259542.68,454199.69,284587.32,498027.81,308810.68,540418.68000000005]
[5,2022,"Region V - Midwest","ILLINOIS","IL","QUINCY",2,"Row House",93607.95,163813.92000000001,122621.26,214587.21,148547.84,259958.73,181745.61,318054.83,215593.55,377288.7,237571.16,415749.53,258111,451694.25]
[5,2022,"Region V - Midwest","ILLINOIS","IL","QUINCY",3,"Walkup",89348.11,156359.19,121810.43,213168.26,154224.95000000001,269893.67,203259.65,355704.38,251849.29,440736.25,283747.87,496558.78,315250.86,551689]
[5,2022,"Region V - Midwest","ILLINOIS","IL","QUINCY",4,"Elevator",96082.6,153732.16,134515.64000000001,215225.03,172948.68,276717.89,230598.24,368957.19,288247.8,461196.48,326680.84000000003,522689.35,365113.88,584182.21]
[5,2022,"Region V - Midwest","ILLINOIS","IL","ROCK ISLAND",1,"Detached/Semi-Detached",113359,198378.23999999999,147189.01,257580.76,176014.43,308025.25,209958.89,367428.06,247218.43,432632.26,271131.38,474479.92,294314.05,515049.58]
[5,2022,"Region V - Midwest","ILLINOIS","IL","ROCK ISLAND",2,"Row House",88102.66,154179.65,115588.1,202279.17,140216.37,245378.64,171888.24,300804.42,204061.18,357107.06,224962.36,393684.12,244527.88,427923.79]
[5,2022,"Region V - Midwest","ILLINOIS","IL","ROCK ISLAND",3,"Walkup",83465.25,146064.19,113633.47,198858.58,143754.76,251570.82,189342.15,331348.76,234492.51,410361.89,264107.15999999997,462187.52000000002,293333.32,513333.32]
[5,2022,"Region V - Midwest","ILLINOIS","IL","ROCK ISLAND",4,"Elevator",90844.99,145351.98000000001,127182.98,203492.77,163520.98000000001,261633.56,218027.97,348844.75,272534.96000000002,436055.94,308872.95,494196.73,345210.95,552337.53]
[5,2022,"Region V - Midwest","ILLINOIS","IL","ROCKFORD",1,"Detached/Semi-Detached",127021.11,222286.95,164666.91,288167.09000000003,196694.56,344215.48,234310.73,410043.77,275691.49,482460.1,302243.28999999998,528925.75,327876.47999999998,573783.85]
[5,2022,"Region V - Midwest","ILLINOIS","IL","ROCKFORD",2,"Row House",100374.52,175655.41,131326.5,229821.38,158925.96,278120.44,194144.45,339752.78,230158.6,402777.56,253532.85,443682.48,275349.78999999998,481862.14]
[5,2022,"Region V - Midwest","ILLINOIS","IL","ROCKFORD",3,"Walkup",96364.88,168638.54,131515.82999999999,230152.7,166617.25,291580.18,219697.17,384470.05,272316,476553,306882.89,537045.06999999995,341039.93,596819.88]
[5,2022,"Region V - Midwest","ILLINOIS","IL","ROCKFORD",4,"Elevator",102660.86,164257.37,143725.20000000001,229960.32000000001,184789.54,295663.27,246386.06,394217.7,307982.57,492772.12,349046.92,558475.06999999995,390111.26,624178.02]
[5,2022,"Region V - Midwest","ILLINOIS","IL","SPRINGFIELD",1,"Detached/Semi-Detached",117403.24,205455.67,152187.82999999999,266328.71000000002,181779.26,318113.71000000002,216530,378927.5,254762.34,445834.09,279293.71000000002,488763.99,302971.92,530200.87]
[5,2022,"Region V - Midwest","ILLINOIS","IL","SPRINGFIELD",2,"Row House",92842.03,162473.56,121456.68,212549.19,146966.47,257191.32,179507.17,314137.55,212792.9,372387.57,234395.39,410191.94,254556.02,445473.04]
[5,2022,"Region V - Midwest","ILLINOIS","IL","SPRINGFIELD",3,"Walkup",89184.61,156073.07,121729.15,213026,154228.03,269899.05,203370.67,355898.67,252088.3,441154.53,284094.49,497165.36,315722.90000000002,552515.07999999996]
[5,2022,"Region V - Midwest","ILLINOIS","IL","SPRINGFIELD",4,"Elevator",94923.03,151876.85999999999,132892.25,212627.6,170861.46,273378.34000000003,227815.28,364504.46,284769.09999999998,455630.57,322738.32,516381.32,360707.53,577132.06000000006]
[5,2022,"Region V - Midwest","INDIANA","IN","ANDERSON",1,"Detached/Semi-Detached",103474.76,181080.83,134226.93,234897.13,160405.79999999999,280710.15000000002,191185.11,334573.94,225014.93,393776.12,246723.7,431766.48,267716.73,468504.29]
[5,2022,"Region V - Midwest","INDIANA","IN","ANDERSON",2,"Row House",81230.649999999994,142153.64000000001,106394.94,186191.15,128877.23,225535.15,157655,275896.25,187004.87,327258.52,206061.07,360606.88,223868.37,391769.64]
[5,2022,"Region V - Midwest","INDIANA","IN","ANDERSON",3,"Walkup",77578.87,135763.01999999999,105776.33,185108.57,133932.44,234381.77,176523.72,308916.51,218730.09,382777.66,246439.99,431269.98,273807.75,479163.56]
[5,2022,"Region V - Midwest","INDIANA","IN","ANDERSON",4,"Elevator",83348.61,133357.76999999999,116688.05,186700.88,150027.49,240043.99,200036.66,320058.65000000002,250045.82,400073.32,283385.26,453416.43,316724.71000000002,506759.54]
[5,2022,"Region V - Midwest","INDIANA","IN","BLOOMINGTON",1,"Detached/Semi-Detached",109510.07,191642.62,141960.68,248431.2,169567.46,296743.05,201989.3,353481.27,237657.77,415901.1,260544.17,455952.3,282636.56,494613.98]
[5,2022,"Region V - Midwest","INDIANA","IN","BLOOMINGTON",2,"Row House",86570.83,151498.95000000001,113258.94,198203.15,137053.62,239843.84,167411.37,292969.89,198459.89,347304.82,218610.84,382568.97,237417.93,415481.38]
[5,2022,"Region V - Midwest","INDIANA","IN","BLOOMINGTON",3,"Walkup",83138.259999999995,145491.95000000001,113470.9,198574.07999999999,143760.91,251581.6,189564.2,331737.36,234970.55,411198.47,264800.40999999997,463400.71,294277.42,514985.49]
[5,2022,"Region V - Midwest","INDIANA","IN","BLOOMINGTON",4,"Elevator",88525.86,141641.38,123936.21,198297.93,159346.54999999999,254954.49,212462.07,339939.31,265577.59000000003,424924.14,300987.93,481580.69,336398.27,538237.25]
[5,2022,"Region V - Midwest","INDIANA","IN","COLUMBUS",1,"Detached/Semi-Detached",106193.87,185839.27,137698.37,240972.15,164507.16,287887.53999999998,196005.83,343010.21,230645.83,403630.21,252873.19,442528.08,274344.59999999998,480103.05]
[5,2022,"Region V - Midwest","INDIANA","IN","COLUMBUS",2,"Row House",83718.05,146506.57999999999,109576.46,191758.81,132650.17000000001,232137.8,162126.45000000001,283721.28000000003,192239.83,336419.71,211786.99,370627.23,230039.47,402569.08]
[5,2022,"Region V - Midwest","INDIANA","IN","COLUMBUS",3,"Walkup",80223.490000000005,140391.10999999999,109449.28,191536.23,138633.29,242608.25,182770.13,319847.74,226518.06,396406.61,255251.21,446689.62,283638.65000000002,496367.64]
[5,2022,"Region V - Midwest","INDIANA","IN","COLUMBUS",4,"Elevator",85723.86,137158.17000000001,120013.4,192021.44,154302.94,246884.71,205737.26,329179.61,257171.57,411474.52,291461.11,466337.79,325750.65999999997,521201.06]
[5,2022,"Region V - Midwest","INDIANA","IN","EVANSVILLE",1,"Detached/Semi-Detached",107388.06,187929.1,139280.14000000001,243740.25,166425.04,291243.82,198331.34,347079.84,233407.93,408463.88,255916.22,447853.38,277672.84000000003,485927.46]
[5,2022,"Region V - Midwest","INDIANA","IN","EVANSVILLE",2,"Row House",84448.82,147785.43,110578.4,193512.2,133911.20000000001,234344.6,163753.41,286568.46999999997,194210.05,339867.59,213982.88,374470.05,232454.21,406794.86]
[5,2022,"Region V - Midwest","INDIANA","IN","EVANSVILLE",3,"Walkup",80763.789999999994,141336.63,110146.64,192756.62,139486.85999999999,244102.01,183865.47,321764.57,227847.13,398732.48,256727.2,449272.6,285254.43,499195.25]
[5,2022,"Region V - Midwest","INDIANA","IN","EVANSVILLE",4,"Elevator",86577.38,138523.81,121208.33,193933.33,155839.28,249342.85,207785.71,332457.13,259732.13,415571.42,294363.08,470980.94,328994.03000000003,526390.46]
[5,2022,"Region V - Midwest","INDIANA","IN","FORT WAYNE",1,"Detached/Semi-Detached",106393.64,186188.87,138060.62,241606.08,165027.16,288797.53000000003,196750.62,344313.59,231601.59,405302.78,253966.76,444441.83,275614.15000000002,482324.77]
[5,2022,"Region V - Midwest","INDIANA","IN","FORT WAYNE",2,"Row House",83222.69,145639.71,109068.96,190870.68,132184.9,231323.57,161823.42000000001,283190.99,192007.78,336013.61,211609.85,370317.25,229938.77,402392.85]
[5,2022,"Region V - Midwest","INDIANA","IN","FORT WAYNE",3,"Walkup",79253.070000000007,138692.88,108002.12,189003.72,136708.10999999999,239239.19,180139.08,315243.39,223169.1,390545.91999999998,251410.28,439967.98,279295.06,488766.35]
[5,2022,"Region V - Midwest","INDIANA","IN","FORT WAYNE",4,"Elevator",85542.77,136868.44,119759.88,191615.81,153976.99,246363.19,205302.65,328484.25,256628.32,410605.31,290845.42,465352.69,325062.53000000003,520100.06]
[5,2022,"Region V - Midwest","INDIANA","IN","GARY",1,"Detached/Semi-Detached",123110.05,215442.58,159909.57,279841.75,191276.39,334733.68,228236.14,399413.24,268784.75,470373.32,294810,515917.51,320064.96999999997,560113.69999999995]
[5,2022,"Region V - Midwest","INDIANA","IN","GARY",2,"Row House",95304.9,166783.57999999999,125119.59,218959.27,151865.68,265764.94,186323.5,326066.12,221272.17,387226.31,243981.72,426968.01,265254.51,464195.4]
[5,2022,"Region V - Midwest","INDIANA","IN","GARY",3,"Walkup",89998.57,157497.5,122455.38,214296.92,154860.51999999999,271005.90999999997,203914.61,356850.57,252487.56,441853.23,284334.93,497586.13,315754.62,552570.57999999996]
[5,2022,"Region V - Midwest","INDIANA","IN","GARY",4,"Elevator",98462.080000000002,157539.34,137846.92000000001,220555.07,177231.75,283570.81,236309,378094.41,295386.25,472618.01,334771.09000000003,535633.75,374155.92,598649.49]
[5,2022,"Region V - Midwest","INDIANA","IN","INDIANAPOLIS",1,"Detached/Semi-Detached",107388.06,187929.1,139280.14000000001,243740.25,166425.04,291243.82,198331.34,347079.84,233407.93,408463.88,255916.22,447853.38,277672.84000000003,485927.46]
[5,2022,"Region V - Midwest","INDIANA","IN","INDIANAPOLIS",2,"Row House",84448.82,147785.43,110578.4,193512.2,133911.20000000001,234344.6,163753.41,286568.46999999997,194210.05,339867.59,213982.88,374470.05,232454.21,406794.86]
[5,2022,"Region V - Midwest","INDIANA","IN","INDIANAPOLIS",3,"Walkup",80763.789999999994,141336.63,110146.64,192756.62,139486.85999999999,244102.01,183865.47,321764.57,227847.13,398732.48,256727.2,449272.6,285254.43,499195.25]
[5,2022,"Region V - Midwest","INDIANA","IN","INDIANAPOLIS",4,"Elevator",86577.38,138523.81,121208.33,193933.33,155839.28,249342.85,207785.71,332457.13,259732.13,415571.42,294363.08,470980.94,328994.03000000003,526390.46]
[5,2022,"Region V - Midwest","INDIANA","IN","KOKOMO",1,"Detached/Semi-Detached",105729.96,185027.42,137148.98000000001,240010.71,163894.89000000001,286816.05,195339.6,341844.3,229901.95,402328.42,252080.72,441141.26,273526.84999999998,478671.98]
[5,2022,"Region V - Midwest","INDIANA","IN","KOKOMO",2,"Row House",83022.42,145289.24,108737.16,190290.03,131709.47,230491.58,161110.94,281944.15000000002,191100.02,334425.03000000003,210570.95,368499.17,228764.97,400338.7]
[5,2022,"Region V - Midwest","INDIANA","IN","KOKOMO",3,"Walkup",79306.399999999994,138786.20000000001,108135.82,189237.69,136923.04,239615.33,180468.43,315819.75,223620.88,391336.54,251952.59,440917.03,279935.03000000003,489886.3]
[5,2022,"Region V - Midwest","INDIANA","IN","KOKOMO",4,"Elevator",85176.37,136282.20000000001,119246.92,190795.08,153317.47,245307.96,204423.29,327077.27,255529.12,408846.59,289599.67,463359.47,323670.21000000002,517872.35]
[5,2022,"Region V - Midwest","INDIANA","IN","LAFAYETTE",1,"Detached/Semi-Detached",106790.96,186884.19,138489.26,242356.2,165466.1,289565.68,197168.59,345045.02,232026.88,406047.04,254394.7,445190.73,276008.71999999997,483015.25]
[5,2022,"Region V - Midwest","INDIANA","IN","LAFAYETTE",2,"Row House",84083.43,147146.01,110077.43,192635.51,133280.69,233241.2,162939.93,285144.88,193224.94,338143.65,212884.94,372548.64,231246.84,404681.97]
[5,2022,"Region V - Midwest","INDIANA","IN","LAFAYETTE",3,"Walkup",80493.64,140863.87,109797.96,192146.43,139060.07999999999,243355.13,183317.8,320806.15000000002,227182.6,397569.55,255989.2,447981.11,284446.53999999998,497781.44]
[5,2022,"Region V - Midwest","INDIANA","IN","LAFAYETTE",4,"Elevator",86150.62,137840.99,120610.86,192977.39,155071.10999999999,248113.78,206761.48,330818.37,258451.85,413522.97,292912.09999999998,468659.36,327372.34999999998,523795.76]
[5,2022,"Region V - Midwest","INDIANA","IN","MUNCIE",1,"Detached/Semi-Detached",105663.36,184910.89,137028.23000000001,239799.4,163721.56,286512.71999999997,195091.34,341409.84,229583.37,401770.89,251716.19,440503.34,273103.65999999997,477931.4]
[5,2022,"Region V - Midwest","INDIANA","IN","MUNCIE",2,"Row House",83187.539999999994,145578.20000000001,108906.32,190586.07,131864.56,230762.98,161211.95000000001,282120.92,191177.37,334560.39,210629.99,368602.49,228798.54,400397.44]
[5,2022,"Region V - Midwest","INDIANA","IN","MUNCIE",3,"Walkup",79629.87,139352.28,108618.21,190081.86,137564.76999999999,240738.34,181345.44,317354.52,224737.2,393290.09,253232.9,443157.57,281382.89,492420.05]
[5,2022,"Region V - Midwest","INDIANA","IN","MUNCIE",4,"Elevator",85236.73,136378.76999999999,119331.43,190930.28,153426.12,245481.79,204568.16,327309.06,255710.2,409136.32,289804.89,463687.83,323899.58,518239.34]
[5,2022,"Region V - Midwest","INDIANA","IN","SOUTH BEND",1,"Detached/Semi-Detached",106924.14,187117.25,138730.75,242778.81,165812.76,290172.34000000003,197665.11,345913.94,232664.05,407162.09,255123.75,446466.56,276855.08,484496.4]
[5,2022,"Region V - Midwest","INDIANA","IN","SOUTH BEND",2,"Row House",83753.19,146568.09,109739.1,192043.42,132970.5,232698.38,162737.91,284791.34000000003,193070.24,337872.92,212766.84,372341.98,231179.7,404564.47999999998]
[5,2022,"Region V - Midwest","INDIANA","IN","SOUTH BEND",3,"Walkup",79846.69,139731.71,108833.19,190458.08,137776.62,241109.09,181563.76,317736.58,224949.95,393662.41,253428.58,443500.01,281550.81,492713.91]
[5,2022,"Region V - Midwest","INDIANA","IN","SOUTH BEND",4,"Elevator",86029.89,137647.82999999999,120441.85,192706.96,154853.81,247766.1,206471.74,330354.78999999998,258089.68,412943.49,292501.64,468002.62,326913.59000000003,523061.76000000001]
[5,2022,"Region V - Midwest","INDIANA","IN","TERRE HAUTE",1,"Detached/Semi-Detached",105729.96,185027.42,137148.98000000001,240010.71,163894.89000000001,286816.05,195339.6,341844.3,229901.95,402328.42,252080.72,441141.26,273526.84999999998,478671.98]
[5,2022,"Region V - Midwest","INDIANA","IN","TERRE HAUTE",2,"Row House",83022.42,145289.24,108737.16,190290.03,131709.47,230491.58,161110.94,281944.15000000002,191100.02,334425.03000000003,210570.95,368499.17,228764.97,400338.7]
[5,2022,"Region V - Midwest","INDIANA","IN","TERRE HAUTE",3,"Walkup",79306.399999999994,138786.20000000001,108135.82,189237.69,136923.04,239615.33,180468.43,315819.75,223620.88,391336.54,251952.59,440917.03,279935.03000000003,489886.3]
[5,2022,"Region V - Midwest","INDIANA","IN","TERRE HAUTE",4,"Elevator",85176.37,136282.20000000001,119246.92,190795.08,153317.47,245307.96,204423.29,327077.27,255529.12,408846.59,289599.67,463359.47,323670.21000000002,517872.35]
[5,2022,"Region V - Midwest","MICHIGAN","MI","ANN ARBOR",1,"Detached/Semi-Detached",115878.33,202787.08,150298.19,263021.83,179595.79,314292.64,214034.81,374560.92,251893.56,440813.74,276187.28000000003,483327.75,299672.34000000003,524426.59]
[5,2022,"Region V - Midwest","MICHIGAN","MI","ANN ARBOR",2,"Row House",91085.41,159399.47,119277.11,208734.95,144454.57,252795.5,176662.71,309159.74,209528.18,366674.32,230865.4,404014.44,250799.67,438899.43]
[5,2022,"Region V - Midwest","MICHIGAN","MI","ANN ARBOR",3,"Walkup",87080.29,152390.5,118753.57,207818.75,150380.76999999999,263166.34999999998,198219.61,346884.32,245629.43,429851.5,276759.28999999998,484328.76,307507.8,538138.66]
[5,2022,"Region V - Midwest","MICHIGAN","MI","ANN ARBOR",4,"Elevator",93401.32,149442.10999999999,130761.84,209218.95,168122.37,268995.78999999998,224163.16,358661.06,280203.95,448326.32,317564.46999999997,508103.17,354925,567880.01]
[5,2022,"Region V - Midwest","MICHIGAN","MI","BATTLE CREEK",1,"Detached/Semi-Detached",105266.04,184215.58,136599.59,239049.29,163282.62,285744.58,194673.38,340678.41,229158.08,401026.64,251288.25,439754.44,272709.09999999998,477240.93]
[5,2022,"Region V - Midwest","MICHIGAN","MI","BATTLE CREEK",2,"Row House",82326.8,144071.9,107897.86,188821.25,130768.78,228845.36,160095.45000000001,280167.03999999998,189960.21,332430.36,209354.92,366371.11,227490.47,398108.33]
[5,2022,"Region V - Midwest","MICHIGAN","MI","BATTLE CREEK",3,"Walkup",78389.31,137181.29,106822.38,186939.16,135212.81,236622.41,178166.73,311791.77,220723.71,386266.48,248653.98,435144.46,276231.42,483404.98]
[5,2022,"Region V - Midwest","MICHIGAN","MI","BATTLE CREEK",4,"Elevator",84628.89,135406.23000000001,118480.45,189568.72,152332,243731.21,203109.34,324974.94,253886.67,406218.68,287738.23,460381.17,321589.78000000003,514543.66]
[5,2022,"Region V - Midwest","MICHIGAN","MI","BAY CITY",1,"Detached/Semi-Detached",108051.74,189090.54,140191.76999999999,245335.6,167557.31,293225.28999999998,199742.35,349549.12,235107.56,411438.23,257802.25,451153.94,279760.14,489580.24]
[5,2022,"Region V - Midwest","MICHIGAN","MI","BAY CITY",2,"Row House",84649.08,148135.89000000001,110910.2,194092.85,134386.62,235176.59,164465.88,287815.28999999998,195117.81,341456.17,215021.78,376288.11,233628,408849]
[5,2022,"Region V - Midwest","MICHIGAN","MI","BAY CITY",3,"Walkup",80710.460000000006,141243.29999999999,110012.94,192522.64,139271.92000000001,243725.86,183536.11,321188.2,227395.34,397941.85,256184.87,448323.53,284614.44,498075.27]
[5,2022,"Region V - Midwest","MICHIGAN","MI","BAY CITY",4,"Elevator",86943.77,139110.04,121721.28,194754.06,156498.79,250398.07,208665.06,333864.09999999998,260831.32,417330.12,295608.83,472974.14,330386.34000000003,528618.16]
[5,2022,"Region V - Midwest","MICHIGAN","MI","DETROIT",1,"Detached/Semi-Detached",118664.02,207662.04,153890.37,269308.14,183870.48,321773.34000000003,219103.79,383431.63,257843.04,451225.32,282701.28000000003,494727.24,306723.37,536765.9]
[5,2022,"Region V - Midwest","MICHIGAN","MI","DETROIT",2,"Row House",93407.69,163463.45000000001,122289.46,214006.55,148072.42000000001,259126.73,181033.14,316807.99,214685.78,375700.12,236532.26,413931.45,256937.2,449640.1]
[5,2022,"Region V - Midwest","MICHIGAN","MI","DETROIT",3,"Walkup",89401.43,156452.51,121944.13,213402.23,154439.89000000001,270269.81,203589,356280.74,252301.07,441526.87,284290.19,497507.82,315890.83,552808.94999999995]
[5,2022,"Region V - Midwest","MICHIGAN","MI","DETROIT",4,"Elevator",95716.2,153145.92000000001,134002.68,214404.29,172289.16,275662.65999999997,229718.88,367550.21,287148.59999999998,459437.77,325435.08,520696.13,363721.56,581954.5]
[5,2022,"Region V - Midwest","MICHIGAN","MI","FLINT",1,"Detached/Semi-Detached",111965.03,195938.8,145244.98000000001,254178.71,173576.54,303758.95,206888.58,362055.01,243500.55,426125.97,266994.76,467240.83,289716.23,507003.4]
[5,2022,"Region V - Midwest","MICHIGAN","MI","FLINT",2,"Row House",87867.24,153767.67000000001,115093.65,201413.9,139420.59,243986.04,170564.29,298487.51,202322.99,354065.23,222943.58,390151.27,242213.83,423874.2]
[5,2022,"Region V - Midwest","MICHIGAN","MI","FLINT",3,"Walkup",83895.37,146816.9,114383.25,200170.69,144826.35,253446.1,190877.86,334036.25,236512.38,413896.67,266472.08,466326.14,296061.12,518106.96]
[5,2022,"Region V - Midwest","MICHIGAN","MI","FLINT",4,"Elevator",90172.54,144276.07,126241.56,201986.5,162310.57999999999,259696.93,216414.1,346262.57,270517.63,432828.21,306586.64,490538.64,342655.66,548249.06999999995]
[5,2022,"Region V - Midwest","MICHIGAN","MI","GRAND RAPIDS",1,"Detached/Semi-Detached",104535.77,182937.59,135567.20000000001,237242.61,161977.01,283459.76,193014.09,337774.65,227139.85,397494.73,249037.68,435815.94,270198.59999999998,472847.55]
[5,2022,"Region V - Midwest","MICHIGAN","MI","GRAND RAPIDS",2,"Row House",82291.649999999994,144010.39000000001,107735.22,188536.63,130448.44,228284.77,159483.98000000001,279096.96000000002,189129.79,330977.13,208375.05,364656.34,226350.23,396112.9]
[5,2022,"Region V - Midwest","MICHIGAN","MI","GRAND RAPIDS",3,"Walkup",78766.11,137840.69,107438.46,188017.3,136069.46,238121.56,179373.09,313902.90000000002,222291.8,389010.65,250476.59,438334.04,278319.25,487058.68]
[5,2022,"Region V - Midwest","MICHIGAN","MI","GRAND RAPIDS",4,"Elevator",84322.85,134916.56,118051.99,188883.18,151781.13,242849.81,202374.84,323799.74,252968.55,404749.68,286697.69,458716.3,320426.83,512682.93]
[5,2022,"Region V - Midwest","MICHIGAN","MI","JACKSON",1,"Detached/Semi-Detached",107057.32,187350.32,138972.25,243201.44,166159.43,290779,198161.64,346782.87,233301.23,408277.15,255852.79999999999,447742.4,277701.46000000002,485977.55]
[5,2022,"Region V - Midwest","MICHIGAN","MI","JACKSON",2,"Row House",83422.95,145990.17000000001,109400.76,191451.34,132660.32999999999,232155.57,162535.9,284437.82,192915.54,337602.19,212648.76,372135.33,231112.57,404447]
[5,2022,"Region V - Midwest","MICHIGAN","MI","JACKSON",3,"Walkup",79199.75,138599.56,107868.42,188769.74,136493.17000000001,238863.05,179809.73,314667.03000000003,222717.32,389755.3,250867.96,439018.94,278655.08,487646.4]
[5,2022,"Region V - Midwest","MICHIGAN","MI","JACKSON",4,"Elevator",85909.17,137454.68,120272.84,192436.55,154636.51,247418.42,206182.01,329891.21999999997,257727.51,412364.03,292091.18,467345.9,326454.84999999998,522327.77]
[5,2022,"Region V - Midwest","MICHIGAN","MI","KALAMAZOO",1,"Detached/Semi-Detached",106990.73,187233.78,138851.5,242990.13,165986.1,290475.67,197913.37,346348.41,232982.64,407719.62,255488.27,447104.48,277278.27,485236.98]
[5,2022,"Region V - Midwest","MICHIGAN","MI","KALAMAZOO",2,"Row House",83588.070000000007,146279.13,109569.93,191747.38,132815.41,232426.98,162636.9,284614.58,192992.89,337737.56,212707.8,372238.65,231146.14,404505.74]
[5,2022,"Region V - Midwest","MICHIGAN","MI","KALAMAZOO",3,"Walkup",79523.22,139165.64000000001,108350.81,189613.91,137134.9,239986.07,180686.74,316201.8,223833.63,391708.86,252148.27,441259.47,280102.94,490180.15]
[5,2022,"Region V - Midwest","MICHIGAN","MI","KALAMAZOO",4,"Elevator",85969.53,137551.25,120357.35,192571.76,154745.16,247592.26,206326.88,330123.01,257908.6,412653.76,292296.40999999997,467674.26,326684.21999999997,522694.76]
[5,2022,"Region V - Midwest","MICHIGAN","MI","LANSING",1,"Detached/Semi-Detached",107918.56,188857.48,139950.28,244912.98,167210.65,292618.63,199245.83,348680.2,234470.39,410323.18,257073.21,449878.11,278913.77,488099.09]
[5,2022,"Region V - Midwest","MICHIGAN","MI","LANSING",2,"Row House",84979.32,148713.81,111248.54,194684.94,134696.81,235719.41,164667.9,288168.82,195272.51,341726.9,215139.87,376494.78,233695.14,408966.49]
[5,2022,"Region V - Midwest","MICHIGAN","MI","LANSING",3,"Walkup",81357.399999999994,142375.46,110977.71,194210.99,140555.38,245971.91,185290.15,324257.77,229627.99,401848.98,258745.5,452804.63,287510.18,503142.81]
[5,2022,"Region V - Midwest","MICHIGAN","MI","LANSING",4,"Elevator",87064.5,139303.20000000001,121890.3,195024.48,156716.1,250745.76,208954.8,334327.67999999999,261193.5,417909.6,296019.3,473630.88,330845.09000000003,529352.16]
[5,2022,"Region V - Midwest","MICHIGAN","MI","MUSKEGON",1,"Detached/Semi-Detached",104668.95,183170.66,135808.71,237665.24,162323.68,284066.44,193510.62,338643.59,227777.03,398609.81,249766.74,437091.79,271044.98,474328.72]
[5,2022,"Region V - Midwest","MICHIGAN","MI","MUSKEGON",2,"Row House",81961.42,143432.48000000001,107396.89,187944.55,130138.26,227741.96,159281.97,278743.44,188975.1,330706.42,208256.97,364449.7,226283.11,395995.44]
[5,2022,"Region V - Midwest","MICHIGAN","MI","MUSKEGON",3,"Walkup",78119.16,136708.54,106473.69,186328.95999999999,134786.01999999999,235875.53,177619.06,310833.34999999998,220059.17,385103.54,247915.98,433852.97,275423.53000000003,481991.18]
[5,2022,"Region V - Midwest","MICHIGAN","MI","MUSKEGON",4,"Elevator",84202.13,134723.41,117882.98,188612.77,151563.82999999999,242502.14,202085.11,323336.18,252606.39,404170.23,286287.24,458059.59,319968.09000000003,511948.96]
[5,2022,"Region V - Midwest","MICHIGAN","MI","SAGINAW",1,"Detached/Semi-Detached",106857.55,187000.71,138610,242567.5,165639.43,289869,197416.84,345479.48,232345.46,406604.56,254759.22,445828.64,276431.90000000002,483755.82]
[5,2022,"Region V - Midwest","MICHIGAN","MI","SAGINAW",2,"Row House",83918.31,146857.04,109908.26,192339.46,133125.59,232969.79,162838.92000000001,284968.09999999998,193147.59,338008.28,212825.89,372445.3,231213.27,404623.22]
[5,2022,"Region V - Midwest","MICHIGAN","MI","SAGINAW",3,"Walkup",80170.16,140297.79,109315.57,191302.25,138418.34,242232.1,182440.78,319271.36,226066.27,395615.97,254708.89,445740.55,282998.67,495247.66]
[5,2022,"Region V - Midwest","MICHIGAN","MI","SAGINAW",4,"Elevator",86090.25,137744.41,120526.36,192842.17,154962.46,247939.93,206616.61,330586.58,258270.76,413233.22,292706.86,468330.99,327142.96000000002,523428.75]
[5,2022,"Region V - Midwest","MICHIGAN","MI","TRAVERSE CITY",1,"Detached/Semi-Detached",103874.31,181780.03,134951.43,236165.01,161445.79999999999,282530.14,192674.7,337180.72,226926.46,397121.31,248910.86,435594,270255.86,472947.76]
[5,2022,"Region V - Midwest","MICHIGAN","MI","TRAVERSE CITY",2,"Row House",80239.94,140419.89000000001,105379.95,184414.9,127946.69,223906.71,157048.95999999999,274835.67,186540.77,326446.34999999998,205706.82,359986.93,223666.97,391417.2]
[5,2022,"Region V - Midwest","MICHIGAN","MI","TRAVERSE CITY",3,"Walkup",75638.039999999994,132366.56,102882.03,180043.55,130082.09,227643.66,171261.62,299707.83,212032.18,371056.31,238758.14,417826.75,265120.58,463961.01]
[5,2022,"Region V - Midwest","MICHIGAN","MI","TRAVERSE CITY",4,"Elevator",82986.44,132778.31,116181.02,185889.63,149375.6,239000.95999999999,199167.46,318667.94,248959.33,398334.93,282153.90000000002,451446.25,315348.47999999998,504557.58]
[5,2022,"Region V - Midwest","MINNESOTA","MN","BRAINERD",1,"Detached/Semi-Detached",110440.11,193270.19,143355.31,250871.8,171393.06,299937.84999999998,204393.37,357688.39,240631.75,421105.57,263888.31,461804.54,286416.61,501229.07]
[5,2022,"Region V - Midwest","MINNESOTA","MN","BRAINERD",2,"Row House",86110.61,150693.57,112914.08,197599.64,136908.69,239590.2,167719.81,293509.67,199058.25,348351.94,219413.56,383973.74,238457.46,417300.56]
[5,2022,"Region V - Midwest","MINNESOTA","MN","BRAINERD",3,"Walkup",81791.039999999994,143134.32,111407.67,194963.42,140979.07999999999,246713.38,185726.78,325021.87,230053.49,402593.61,259136.85,453489.49,287846,503730.5]
[5,2022,"Region V - Midwest","MINNESOTA","MN","BRAINERD",4,"Elevator",88650.82,141841.31,124111.14,198577.83,159571.47,255314.35,212761.96,340419.14,265952.45,425523.92,301412.77,482260.45,336873.1,538996.97]
[5,2022,"Region V - Midwest","MINNESOTA","MN","DULUTH",1,"Detached/Semi-Detached",119791.62,209635.33,155351.39000000001,271864.93,185615.03,324826.28999999998,221181.03,387066.81,260286.55,455501.46,285379.78000000003,499414.62,309628.42,541849.74]
[5,2022,"Region V - Midwest","MINNESOTA","MN","DULUTH",2,"Row House",94303.57,165031.25,123460.56,216055.99,149488.54,261604.94,182761.11,319831.94,216733.35,379283.37,238787.19,417877.58,259385.5,453924.62]
[5,2022,"Region V - Midwest","MINNESOTA","MN","DULUTH",3,"Walkup",90265.2,157964.1,123123.88,215466.79,155935.19,272886.58,205561.35,359732.36,254746.46,445806.3,287046.48,502331.34,318954.46999999997,558170.31999999995]
[5,2022,"Region V - Midwest","MINNESOTA","MN","DULUTH",4,"Elevator",96630.080000000002,154608.13,135282.10999999999,216451.39,173934.15,278294.64,231912.2,371059.52,289890.24,463824.4,328542.28000000003,525667.65,367194.31,587510.9]
[5,2022,"Region V - Midwest","MINNESOTA","MN","MANKATO",1,"Detached/Semi-Detached",115944.92,202903.61,150418.94,263233.14,179769.13,314595.96999999997,214283.08,374995.39,252212.15,441371.26,276551.81,483965.67,300095.52,525167.17000000004]
[5,2022,"Region V - Midwest","MINNESOTA","MN","MANKATO",2,"Row House",90920.29,159110.51,119107.95,208438.91,144299.48000000001,252524.1,176561.7,308982.98,209450.83,366538.96,230806.35,403911.12,250766.11,438840.69]
[5,2022,"Region V - Midwest","MINNESOTA","MN","MANKATO",3,"Walkup",86756.82,151824.43,118271.19,206974.58,149739.04999999999,262043.34,197342.59,345349.54,244513.11,427897.95,275478.98,482088.22,306059.94,535604.9]
[5,2022,"Region V - Midwest","MINNESOTA","MN","MANKATO",4,"Elevator",93340.96,149345.53,130677.34,209083.74,168013.72,268821.96000000002,224018.29,358429.27,280022.87,448036.59,317359.25,507774.8,354695.63,567513.02]
[5,2022,"Region V - Midwest","MINNESOTA","MN","MINNEAPOLIS",1,"Detached/Semi-Detached",125960.11,220430.19,163326.64000000001,285821.61,195123.35,341465.87,232481.75,406843.06,273566.57,478741.49,299929.31,524876.29,325394.62,569440.59]
[5,2022,"Region V - Midwest","MINNESOTA","MN","MINNEAPOLIS",2,"Row House",99313.51,173798.65,129986.23,227475.91,157354.75,275370.82,192315.47,336552.07,228033.68,399058.95,251218.87,439633.02,272867.93,477518.88]
[5,2022,"Region V - Midwest","MINNESOTA","MN","MINNEAPOLIS",3,"Walkup",95177.64,166560.88,129853.7,227243.97,164480.22,287840.39,216847.8,379483.65,268754.28999999998,470320.01,302846.28999999998,529981.01,336528.43,588924.76]
[5,2022,"Region V - Midwest","MINNESOTA","MN","MINNEAPOLIS",4,"Elevator",101686.62,162698.59,142361.26,227778.02,183035.91,292857.46000000002,244047.88,390476.61,305059.84999999998,488095.76,345734.49,553175.19999999995,386409.14,618254.63]
[5,2022,"Region V - Midwest","MINNESOTA","MN","ROCHESTER",1,"Detached/Semi-Detached",120919.22,211608.63,156812.41,274421.71000000002,187359.57,327879.24,223258.28,390701.98,262730.06,459777.6,288058.28999999998,504102.01,312533.46999999997,546933.56999999995]
[5,2022,"Region V - Midwest","MINNESOTA","MN","ROCHESTER",2,"Row House",95199.46,166599.06,124631.67,218105.42,150904.66,264083.15000000002,184489.08,322855.89,218780.93,382866.62,241042.13,421823.72,261833.8,458209.14]
[5,2022,"Region V - Midwest","MINNESOTA","MN","ROCHESTER",3,"Walkup",91128.960000000006,159475.68,124303.63,217531.35,157430.49,275503.35999999999,207533.7,363183.97,257191.85,450085.74,289802.78000000003,507154.86,322018.09999999998,563531.68000000005]
[5,2022,"Region V - Midwest","MINNESOTA","MN","ROCHESTER",4,"Elevator",97543.96,156070.34,136561.54999999999,218498.48,175579.13,280926.62,234105.51,374568.82,292631.89,468211.03,331649.46999999997,530639.16,370667.06,593067.30000000005]
[5,2022,"Region V - Midwest","MINNESOTA","MN","SAINT PAUL",1,"Detached/Semi-Detached",126026.7,220546.72,163447.39000000001,286032.92,195296.69,341769.2,232730.01,407277.52,273885.15999999997,479299.02,300293.83,525514.21,325817.81,570181.16]
[5,2022,"Region V - Midwest","MINNESOTA","MN","SAINT PAUL",2,"Row House",99148.4,173509.69,129817.07,227179.87,157199.66,275099.40999999997,192214.46,336375.31,227956.33,398923.59,251159.83,439529.7,272834.37,477460.14]
[5,2022,"Region V - Midwest","MINNESOTA","MN","SAINT PAUL",3,"Walkup",94854.17,165994.79999999999,129371.31,226399.8,163838.5,286717.37,215970.79,377948.88,267637.96999999997,468366.45,301565.98,527740.47,335080.57,586391]
[5,2022,"Region V - Midwest","MINNESOTA","MN","SAINT PAUL",4,"Elevator",101626.25,162602.01,142276.76,227642.81,182927.26,292683.62,243903.01,390244.82,304878.76,487806.03,345529.27,552846.82999999996,386179.77,617887.64]
[5,2022,"Region V - Midwest","MINNESOTA","MN","ST. CLOUD",1,"Detached/Semi-Detached",118797.21,207895.11,154131.87,269730.76,184217.15,322380.01,219600.32,384300.56,258480.22,452340.38,283430.33,496003.08,307569.75,538247.05000000005]
[5,2022,"Region V - Midwest","MINNESOTA","MN","ST. CLOUD",2,"Row House",93077.45,162885.54,121951.13,213414.47,147762.23999999999,258583.92,180831.13,316454.46999999997,214531.09,375429.4,236414.17,413724.8,256870.07,449522.62]
[5,2022,"Region V - Midwest","MINNESOTA","MN","ST. CLOUD",3,"Walkup",88754.49,155320.35999999999,120979.37,211713.89,153156.44,268023.77,201834.96,353211.19,250068.43,437619.75,281729.57,493026.75,312995.11,547741.43999999994]
[5,2022,"Region V - Midwest","MINNESOTA","MN","ST. CLOUD",4,"Elevator",95595.48,152952.76999999999,133833.67000000001,214133.88,172071.86,275314.98,229429.15,367086.64,286786.44,458858.3,325024.63,520039.41,363262.82,581220.52]
[5,2022,"Region V - Midwest","OHIO","OH","AKRON",1,"Detached/Semi-Detached",110637.66,193615.91,143421.70000000001,250987.98,171312,299796,204066.54,357116.44,240101.28,420177.24,263222.68,460639.69,285541.61,499697.82]
[5,2022,"Region V - Midwest","OHIO","OH","AKRON",2,"Row House",87466.71,153066.75,114430.05,200252.59,138469.74,242322.05,169139.34,295993.84000000003,200507.47,350888.07,220865.77,386515.11,239866.23,419765.9]
[5,2022,"Region V - Midwest","OHIO","OH","AKRON",3,"Walkup",84002.02,147003.54,114650.65,200638.64,145256.22,254198.38,191536.55,335188.96999999997,237415.94,415477.9,267556.7,468224.23,297341.06,520346.86]
[5,2022,"Region V - Midwest","OHIO","OH","AKRON",4,"Elevator",89439.74,143103.59,125215.64,200345.03,160991.54,257586.46,214655.38,343448.62,268319.23,429310.77,304095.13,486552.21,339871.02,543793.65]
[5,2022,"Region V - Midwest","OHIO","OH","CANTON",1,"Detached/Semi-Detached",107188.28,187579.49,138917.89000000001,243106.3,165905.04,290333.81,197586.54,345776.44,232452.16,406791.27,254822.63,445939.61,276403.26,483705.71]
[5,2022,"Region V - Midwest","OHIO","OH","CANTON",2,"Row House",84944.17,148652.29999999999,111085.9,194400.32,134376.47,235158.82,164056.43,287098.75,194442.1,340273.67,214160.01,374780.01,232554.9,406971.07]
[5,2022,"Region V - Midwest","OHIO","OH","CANTON",3,"Walkup",81734.2,143034.85,111593.79,195289.13,141412.03,247471.06,186496.51,326368.90000000002,231196.08,404593.15,260568.12,455994.2,289598,506796.51]
[5,2022,"Region V - Midwest","OHIO","OH","CANTON",4,"Elevator",86758.46,138813.53,121461.84,194338.95,156165.22,249864.36,208220.3,333152.48,260275.37,416440.6,294978.75,471966.01,329682.14,527491.43000000005]
[5,2022,"Region V - Midwest","OHIO","OH","CINCINNATI",1,"Detached/Semi-Detached",108051.74,189090.54,140191.76999999999,245335.6,167557.31,293225.28999999998,199742.35,349549.12,235107.56,411438.23,257802.25,451153.94,279760.14,489580.24]
[5,2022,"Region V - Midwest","OHIO","OH","CINCINNATI",2,"Row House",84649.08,148135.89000000001,110910.2,194092.85,134386.62,235176.59,164465.88,287815.28999999998,195117.81,341456.17,215021.78,376288.11,233628,408849]
[5,2022,"Region V - Midwest","OHIO","OH","CINCINNATI",3,"Walkup",80710.460000000006,141243.29999999999,110012.94,192522.64,139271.92000000001,243725.86,183536.11,321188.2,227395.34,397941.85,256184.87,448323.53,284614.44,498075.27]
[5,2022,"Region V - Midwest","OHIO","OH","CINCINNATI",4,"Elevator",86943.77,139110.04,121721.28,194754.06,156498.79,250398.07,208665.06,333864.09999999998,260831.32,417330.12,295608.83,472974.14,330386.34000000003,528618.16]
[5,2022,"Region V - Midwest","OHIO","OH","CLEVELAND",1,"Detached/Semi-Detached",112362.35,196634.12,145673.60999999999,254928.83,174015.49,304527.09999999998,207306.54,362786.45,243925.84,426870.22,267422.7,467989.73,290110.78999999998,507693.88]
[5,2022,"Region V - Midwest","OHIO","OH","CLEVELAND",2,"Row House",88727.99,155273.97,116102.13,203178.72,140516.38,245903.67,171680.8,300441.40000000002,203540.15,356195.27,224218.66,392382.66,243521.9,426163.33]
[5,2022,"Region V - Midwest","OHIO","OH","CLEVELAND",3,"Walkup",85135.94,148987.89000000001,116179.09,203313.4,147178.31,257562.05,194056.58,339599.02,240525.88,420920.29,271051.01,474339.26,301212.59999999998,527122.05000000005]
[5,2022,"Region V - Midwest","OHIO","OH","CLEVELAND",4,"Elevator",90780.39,145248.62,127092.54,203348.07,163404.70000000001,261447.52,217872.93,348596.69,272341.15999999997,435745.87,308653.32,493845.32,344965.47,551944.77]
[5,2022,"Region V - Midwest","OHIO","OH","COLUMBUS",1,"Detached/Semi-Detached",110240.34,192920.6,142993.07,250237.87,170873.06,299027.86,203648.58,356385.01,239676,419432.99,262794.74,459890.79,285147.06,499007.35]
[5,2022,"Region V - Midwest","OHIO","OH","COLUMBUS",2,"Row House",86605.97,151560.45000000001,113421.58,198487.77,137373.96,240404.43,168022.84,294039.96000000002,199290.31,348758.04,219590.7,384283.72,238558.17,417476.79]
[5,2022,"Region V - Midwest","OHIO","OH","COLUMBUS",3,"Walkup",82761.460000000006,144832.56,112854.82,197495.94,142904.26,250082.45,188357.84,329626.21999999997,233402.45,408454.29,262977.78999999998,460211.13,292189.59000000003,511331.79]
[5,2022,"Region V - Midwest","OHIO","OH","COLUMBUS",4,"Elevator",88831.9,142131.04,124364.66,198983.46,159897.42000000001,255835.88,213196.56,341114.5,266495.7,426393.13,302028.46000000002,483245.55,337561.22,540097.96]
[5,2022,"Region V - Midwest","OHIO","OH","DAYTON",1,"Detached/Semi-Detached",107985.15,188974.01,140071.03,245124.3,167383.98000000001,292921.96000000002,199494.09,349114.66,234788.98,410880.71,257437.73,450516.03,279336.95,488839.67]
[5,2022,"Region V - Midwest","OHIO","OH","DAYTON",2,"Row House",84814.2,148424.85,111079.37,194388.9,134541.72,235448.01,164566.89000000001,287992.06,195195.16,341591.54,215080.83,376391.45,233661.57,408907.75]
[5,2022,"Region V - Midwest","OHIO","OH","DAYTON",3,"Walkup",81033.929999999993,141809.38,110495.32,193366.82,139913.65,244848.89,184413.14,322722.99,228511.67,399895.42,257465.19,450564.09,286062.32,500609.05]
[5,2022,"Region V - Midwest","OHIO","OH","DAYTON",4,"Elevator",87004.14,139206.62,121805.79,194889.27,156607.45000000001,250571.92,208809.93,334095.89,261012.41,417619.87,295814.07,473302.52,330615.71999999997,528985.17000000004]
[5,2022,"Region V - Midwest","OHIO","OH","HAMILTON",1,"Detached/Semi-Detached",105132.86,183982.51,136358.09,238626.67,162935.95000000001,285137.90999999997,194176.85,339809.48,228520.9,399911.58,250559.2,438478.6,271862.73,475759.77]
[5,2022,"Region V - Midwest","OHIO","OH","HAMILTON",2,"Row House",82657.039999999994,144649.82,108236.19,189413.33,131078.96,229388.18,160297.46,280520.56,190114.91,332701.08,209473.01,366577.76,227557.6,398225.81]
[5,2022,"Region V - Midwest","OHIO","OH","HAMILTON",3,"Walkup",79036.25,138313.44,107787.14,188627.5,136496.26,238868.45,179920.76,314861.33,222956.34,390173.6,251214.59,439625.54,279127.14,488472.49]
[5,2022,"Region V - Midwest","OHIO","OH","HAMILTON",4,"Elevator",84749.61,135599.38,118649.46,189839.13,152549.29999999999,244078.89,203399.07,325438.51,254248.84,406798.14,288148.68,461037.89,322048.52,515277.65]
[5,2022,"Region V - Midwest","OHIO","OH","LIMA",1,"Detached/Semi-Detached",102347.16,179107.54,132765.91,232340.35,158661.26,277657.2,189107.87,330938.77,222571.42,389499.98,244045.2,427079.09,264811.68,463420.45]
[5,2022,"Region V - Midwest","OHIO","OH","LIMA",2,"Row House",80334.759999999995,140585.82999999999,105223.84,184141.72,127461.11,223056.94,155927.03,272872.3,184957.3,323675.27,203806.14,356660.74,221420.07,387485.12]
[5,2022,"Region V - Midwest","OHIO","OH","LIMA",3,"Walkup",76715.11,134251.44,104596.58,183044.01,132437.14000000001,231764.99,174551.37,305464.90000000002,216284.7,378498.22,243683.69,426446.47,270744.11,473802.19]
[5,2022,"Region V - Midwest","OHIO","OH","LIMA",4,"Elevator",82434.73,131895.56,115408.62,184653.79,148382.51,237412.01,197843.34,316549.34999999998,247304.18,395686.69,280278.07,448444.91,313251.96000000002,501203.14]
[5,2022,"Region V - Midwest","OHIO","OH","LORAIN",1,"Detached/Semi-Detached",110173.75,192804.06,142872.32000000001,250026.56,170699.73,298724.53000000003,203400.31,355950.55,239357.41,418875.46,262430.21000000002,459252.87,284723.87,498266.77]
[5,2022,"Region V - Midwest","OHIO","OH","LORAIN",2,"Row House",86771.09,151849.41,113590.75,198783.81,137529.04999999999,240675.83,168123.84,294216.71999999997,199367.66,348893.4,219649.74,384387.05,238591.73,417535.53]
[5,2022,"Region V - Midwest","OHIO","OH","LORAIN",3,"Walkup",83084.929999999993,145398.63,113337.2,198340.11,143545.98000000001,251205.46,189234.86,331161,234518.77,410407.85,264258.09000000003,462451.66,293637.45,513865.54]
[5,2022,"Region V - Midwest","OHIO","OH","LORAIN",4,"Elevator",88892.26,142227.62,124449.17,199118.67,160006.07,256009.72,213341.43,341346.29,266676.78000000003,426682.86,302233.69,483573.91,337790.59,540464.96]
[5,2022,"Region V - Midwest","OHIO","OH","MANSFIELD",1,"Detached/Semi-Detached",104005.26,182009.21,134897.07,236069.87,161191.4,282084.95,192099.6,336174.3,226077.39,395635.43,247880.69,433791.21,268957.67,470675.92]
[5,2022,"Region V - Midwest","OHIO","OH","MANSFIELD",2,"Row House",81761.149999999994,143082.01,107065.08,187363.89,129662.83,226909.96,158569.49,277496.59999999998,188067.33,329117.82,207218.06,362631.61,225109.3,393941.27]
[5,2022,"Region V - Midwest","OHIO","OH","MANSFIELD",3,"Walkup",78172.490000000005,136801.85,106607.39,186562.93,135000.95000000001,236251.66,177948.4,311409.71000000002,220510.95,385894.15,248458.29,434802.01,276063.5,483111.12]
[5,2022,"Region V - Midwest","OHIO","OH","MANSFIELD",4,"Elevator",83835.73,134137.17000000001,117370.02,187792.03,150904.31,241446.9,201205.75,321929.2,251507.18,402411.5,285041.46999999997,456066.37,318575.77,509721.23]
[5,2022,"Region V - Midwest","OHIO","OH","MARION",1,"Detached/Semi-Detached",105132.86,183982.51,136358.09,238626.67,162935.95000000001,285137.90999999997,194176.85,339809.48,228520.9,399911.58,250559.2,438478.6,271862.73,475759.77]
[5,2022,"Region V - Midwest","OHIO","OH","MARION",2,"Row House",82657.039999999994,144649.82,108236.19,189413.33,131078.96,229388.18,160297.46,280520.56,190114.91,332701.08,209473.01,366577.76,227557.6,398225.81]
[5,2022,"Region V - Midwest","OHIO","OH","MARION",3,"Walkup",79036.25,138313.44,107787.14,188627.5,136496.26,238868.45,179920.76,314861.33,222956.34,390173.6,251214.59,439625.54,279127.14,488472.49]
[5,2022,"Region V - Midwest","OHIO","OH","MARION",4,"Elevator",84749.61,135599.38,118649.46,189839.13,152549.29999999999,244078.89,203399.07,325438.51,254248.84,406798.14,288148.68,461037.89,322048.52,515277.65]
[5,2022,"Region V - Midwest","OHIO","OH","SPRINGFIELD",1,"Detached/Semi-Detached",107985.15,188974.01,140071.03,245124.3,167383.98000000001,292921.96000000002,199494.09,349114.66,234788.98,410880.71,257437.73,450516.03,279336.95,488839.67]
[5,2022,"Region V - Midwest","OHIO","OH","SPRINGFIELD",2,"Row House",84814.2,148424.85,111079.37,194388.9,134541.72,235448.01,164566.89000000001,287992.06,195195.16,341591.54,215080.83,376391.45,233661.57,408907.75]
[5,2022,"Region V - Midwest","OHIO","OH","SPRINGFIELD",3,"Walkup",81033.929999999993,141809.38,110495.32,193366.82,139913.65,244848.89,184413.14,322722.99,228511.67,399895.42,257465.19,450564.09,286062.32,500609.05]
[5,2022,"Region V - Midwest","OHIO","OH","SPRINGFIELD",4,"Elevator",87004.14,139206.62,121805.79,194889.27,156607.45000000001,250571.92,208809.93,334095.89,261012.41,417619.87,295814.07,473302.52,330615.71999999997,528985.17000000004]
[5,2022,"Region V - Midwest","OHIO","OH","TOLEDO",1,"Detached/Semi-Detached",113623.13,198840.47,147376.13,257908.23,176106.69,308186.71000000002,209880.31,367290.54,247006.52,432261.41,270830.25,473952.94,293862.21000000002,514258.86]
[5,2022,"Region V - Midwest","OHIO","OH","TOLEDO",2,"Row House",89293.63,156263.85999999999,116934.9,204636.07,141622.32,247839.06,173206.75,303111.81,205433.02,359507.79,226355.51,396122.13,245903.06,430330.35]
[5,2022,"Region V - Midwest","OHIO","OH","TOLEDO",3,"Walkup",85352.75,149367.32,116394.07,203689.61,147390.16,257932.78,194274.89,339981.06,240738.63,421292.6,271246.68,474681.68,301380.51,527415.88]
[5,2022,"Region V - Midwest","OHIO","OH","TOLEDO",4,"Elevator",91573.55,146517.67000000001,128202.96,205124.74,164832.38,263731.81,219776.51,351642.42,274720.64000000001,439553.02,311350.05,498160.09,347979.47,556767.16]
[5,2022,"Region V - Midwest","OHIO","OH","YOUNGSTOWN",1,"Detached/Semi-Detached",110770.84,193848.98,143663.20000000001,251410.61,171658.67,300402.67,204563.07,357985.37,240738.46,421292.3,263951.73,461915.53,286387.99,501178.98]
[5,2022,"Region V - Midwest","OHIO","OH","YOUNGSTOWN",2,"Row House",87136.48,152488.82999999999,114091.72,199660.5,138159.56,241779.24,168937.32,295640.32000000001,200352.77,350617.34,220747.69,386308.46,239799.1,419648.42]
[5,2022,"Region V - Midwest","OHIO","OH","YOUNGSTOWN",3,"Walkup",83355.08,145871.39000000001,113685.89,198950.3,143972.76999999999,251952.34,189782.52,332119.40999999997,235183.31,411570.79,264996.09000000003,463743.16,294445.34000000003,515279.35]
[5,2022,"Region V - Midwest","OHIO","OH","YOUNGSTOWN",4,"Elevator",89319.02,142910.44,125046.63,200074.61,160774.24,257238.79,214365.65,342985.05,267957.07,428731.31,303684.67,485895.49,339412.28,543059.66]
[5,2022,"Region V - Midwest","WISCONSIN","WI","BELOIT",1,"Detached/Semi-Detached",114883.91,201046.85,149078.66,260887.66,178197.91,311846.34999999998,212454.09,371794.67,250087.22,437652.64,274237.82,479916.19,297613.65000000002,520823.89]
[5,2022,"Region V - Midwest","WISCONSIN","WI","BELOIT",2,"Row House",89859.29,157253.75,117767.67,206093.43,142728.26999999999,249774.47,174732.72,305782.25,207325.91,362820.33,228492.37,399861.64,248284.24,434497.42]
[5,2022,"Region V - Midwest","WISCONSIN","WI","BELOIT",3,"Walkup",85569.58,149746.76,116609.05,204065.84,147602.01999999999,258303.53,194493.22,340363.13,240951.39,421664.94,271442.37,475024.14,301548.43,527709.76]
[5,2022,"Region V - Midwest","WISCONSIN","WI","BELOIT",4,"Elevator",92366.71,147786.74,129313.39,206901.43,166260.07999999999,266016.13,221680.1,354688.17,277100.13,443360.22,314046.81,502474.91,350993.5,561589.61]
[5,2022,"Region V - Midwest","WISCONSIN","WI","EAU CLAIRE",1,"Detached/Semi-Detached",115878.33,202787.08,150298.19,263021.83,179595.79,314292.64,214034.81,374560.92,251893.56,440813.74,276187.28000000003,483327.75,299672.34000000003,524426.59]
[5,2022,"Region V - Midwest","WISCONSIN","WI","EAU CLAIRE",2,"Row House",91085.41,159399.47,119277.11,208734.95,144454.57,252795.5,176662.71,309159.74,209528.18,366674.32,230865.4,404014.44,250799.67,438899.43]
[5,2022,"Region V - Midwest","WISCONSIN","WI","EAU CLAIRE",3,"Walkup",87080.29,152390.5,118753.57,207818.75,150380.76999999999,263166.34999999998,198219.61,346884.32,245629.43,429851.5,276759.28999999998,484328.76,307507.8,538138.66]
[5,2022,"Region V - Midwest","WISCONSIN","WI","EAU CLAIRE",4,"Elevator",93401.32,149442.10999999999,130761.84,209218.95,168122.37,268995.78999999998,224163.16,358661.06,280203.95,448326.32,317564.46999999997,508103.17,354925,567880.01]
[5,2022,"Region V - Midwest","WISCONSIN","WI","GREEN BAY",1,"Detached/Semi-Detached",118861.57,208007.75,153956.75,269424.31,183789.42,321631.48,218776.95,382859.66,257312.56,450296.97,282035.64,493562.37,305848.36,535234.63]
[5,2022,"Region V - Midwest","WISCONSIN","WI","GREEN BAY",2,"Row House",94763.78,165836.62,123805.43,216659.5,149633.47,261858.57,182452.66,319292.15999999997,216134.99,378236.23,237984.46,416472.81,258345.96,452105.43]
[5,2022,"Region V - Midwest","WISCONSIN","WI","GREEN BAY",3,"Walkup",91612.42,160321.73000000001,125187.12,219077.46,158717.03,277754.8,209398.77,366447.85,259663.52,454411.16,292710.03999999998,512242.57,325385.90000000002,569425.31999999995]
[5,2022,"Region V - Midwest","WISCONSIN","WI","GREEN BAY",4,"Elevator",96505.12,154408.20000000001,135107.17000000001,216171.48,173709.22,277934.76,231612.3,370579.69,289515.37,463224.61,328117.42,524987.89,366719.47,586751.17000000004]
[5,2022,"Region V - Midwest","WISCONSIN","WI","KENOSHA",1,"Detached/Semi-Detached",121980.22,213465.39,158152.68,276767.19,188930.78,330628.86,225087.25,393902.69,264854.98,463496.21,290372.27,508151.47,315015.33,551276.84]
[5,2022,"Region V - Midwest","WISCONSIN","WI","KENOSHA",2,"Row House",96260.47,168455.81,125971.94,220450.9,152475.87,266832.77,186318.06,326056.61,220905.85,386585.23,243356.1,425873.18,264315.65999999997,462552.4]
[5,2022,"Region V - Midwest","WISCONSIN","WI","KENOSHA",3,"Walkup",92316.2,161553.35,125965.75999999999,220440.08,159567.51999999999,279243.15000000002,210383.06,368170.36,260753.56,456318.73,293839.38,514218.92,326529.59999999998,571426.80000000005]
[5,2022,"Region V - Midwest","WISCONSIN","WI","KENOSHA",4,"Elevator",98518.2,157629.13,137925.49,220680.78,177332.77,283732.43,236443.69,378309.91,295554.61,472887.39,334961.90000000002,535939.04,374369.18,598990.68999999994]
[5,2022,"Region V - Midwest","WISCONSIN","WI","LA CROSSE",1,"Detached/Semi-Detached",115017.09,201279.91,149320.16,261310.28,178544.58,312453.01,212950.62,372663.59,250724.4,438767.7,274966.88,481192.03,298460.03000000003,522305.05]
[5,2022,"Region V - Midwest","WISCONSIN","WI","LA CROSSE",2,"Row House",89529.05,156675.82999999999,117429.34,205501.35,142418.09,249231.66,174530.7,305428.73,207171.21,362549.61,228374.28,399654.99,248217.11,434379.94]
[5,2022,"Region V - Midwest","WISCONSIN","WI","LA CROSSE",3,"Walkup",84922.63,148614.60999999999,115644.29,202377.5,146318.57,256057.5,192739.19,337293.57,238718.76,417757.82,268881.75,470543.07,298652.71000000002,522642.25]
[5,2022,"Region V - Midwest","WISCONSIN","WI","LA CROSSE",4,"Elevator",92245.99,147593.57999999999,129144.38,206631.02,166042.78,265668.45,221390.37,354224.6,276737.96999999997,442780.75,313636.36,501818.19,350534.76,560855.62]
[5,2022,"Region V - Midwest","WISCONSIN","WI","MADISON",1,"Detached/Semi-Detached",117005.93,204760.37,151759.21,265578.61,181340.34,317345.59000000003,216112.06,378196.1,254337.07,445089.88,278865.78999999998,488015.13,302577.39,529510.43000000005]
[5,2022,"Region V - Midwest","WISCONSIN","WI","MADISON",2,"Row House",91981.3,160967.26999999999,120448.22,210784.38,145870.69,255273.71,178390.68,312183.69,211575.75,370257.57,233120.33,407960.58,253247.97,443183.95]
[5,2022,"Region V - Midwest","WISCONSIN","WI","MADISON",3,"Walkup",87944.05,153902.09,119933.32,209883.31,151876.07,265783.13,200191.96,350335.93,248074.82,434130.94,279515.59000000003,489152.28,310571.44,543500.02]
[5,2022,"Region V - Midwest","WISCONSIN","WI","MADISON",4,"Elevator",94315.199999999997,150904.32000000001,132041.28,211266.05,169767.36,271627.77,226356.47,362170.36,282945.59000000003,452712.95,320671.67,513074.68,358397.75,573436.41]
[5,2022,"Region V - Midwest","WISCONSIN","WI","MILWAUKEE",1,"Detached/Semi-Detached",119061.34,208357.35,154319,270058.25,184309.42,322541.49,219521.75,384163.06,258268.32,451969.57,283129.21999999997,495476.13,307117.93,537456.37]
[5,2022,"Region V - Midwest","WISCONSIN","WI","MILWAUKEE",2,"Row House",94268.43,164969.75,123297.93,215771.37,149168.20000000001,261044.35,182149.64,318761.87,215902.94,377830.15,237807.33,416162.83,258245.26,451929.21]
[5,2022,"Region V - Midwest","WISCONSIN","WI","MILWAUKEE",3,"Walkup",90642,158623.49,123739.96,216544.94,156791.85,274385.74,206767.71,361843.49,256314.56,448550.47,288869.09999999998,505520.93,321042.3,561824.02]
[5,2022,"Region V - Midwest","WISCONSIN","WI","MILWAUKEE",4,"Elevator",96324.04,154118.47,134853.66,215765.86,173383.28,277413.25,231177.7,369884.33,288972.13,462355.41,327501.74,524002.8,366031.35999999999,585650.18999999994]
[5,2022,"Region V - Midwest","WISCONSIN","WI","OSHKOSH",1,"Detached/Semi-Detached",111434.53,195010.42,144574.84,253005.97,172790.94,302384.14,205974.09,360454.65,242438.09,424266.66,265837.77,465216.1,288475.28999999998,504831.77]
[5,2022,"Region V - Midwest","WISCONSIN","WI","OSHKOSH",2,"Row House",87336.74,152839.29999999999,114423.52,200241.16,138634.99,242611.23,169649.8,296887.15000000002,201260.53,352205.93,221786.59,388126.54,240972.9,421702.57]
[5,2022,"Region V - Midwest","WISCONSIN","WI","OSHKOSH",3,"Walkup",83301.75,145778.07,113552.19,198716.33,143757.82999999999,251576.21,189453.17,331543.05,234731.53,410780.17,264453.78000000003,462794.11,293805.37,514159.4]
[5,2022,"Region V - Midwest","WISCONSIN","WI","OSHKOSH",4,"Elevator",89685.42,143496.68,125559.59,200895.35,161433.76,258294.02,215245.01,344392.02,269056.26,430490.03,304930.43,487888.7,340804.6,545287.37]
[5,2022,"Region V - Midwest","WISCONSIN","WI","RACINE",1,"Detached/Semi-Detached",118597.43,207545.51,153769.62,269096.83,183697.15,321470.01,218855.52,382997.17,257524.45,450667.79,282336.76,494089.32,306300.18,536025.31999999995]
[5,2022,"Region V - Midwest","WISCONSIN","WI","RACINE",2,"Row House",93572.81,163752.41,122458.63,214302.6,148227.51,259398.14,181134.15,316984.76,214763.13,375835.48,236591.3,414034.77,256970.77,449698.84]
[5,2022,"Region V - Midwest","WISCONSIN","WI","RACINE",3,"Walkup",89724.91,157018.59,122426.51,214246.39999999999,155081.60999999999,271392.82,204466.01,357815.52,253417.38,443480.42,285570.49,499748.36,317338.69,555342.71]
[5,2022,"Region V - Midwest","WISCONSIN","WI","RACINE",4,"Elevator",95776.56,153242.5,134087.18,214539.5,172397.81,275836.5,229863.75,367782,287329.68,459727.5,325640.31,521024.5,363950.93,582321.5]
[5,2022,"Region V - Midwest","WISCONSIN","WI","SUPERIOR",1,"Detached/Semi-Detached",111567.71,195243.49,144816.34,253428.59,173137.61,302990.81,206470.62,361323.58,243075.27,425381.72,266566.82,466491.94,289321.67,506312.92]
[5,2022,"Region V - Midwest","WISCONSIN","WI","SUPERIOR",2,"Row House",87006.5,152261.38,114085.19,199649.08,138324.81,242068.42,169447.79,296533.63,201105.83,351935.2,221668.51,387919.88,240905.77,421585.09]
[5,2022,"Region V - Midwest","WISCONSIN","WI","SUPERIOR",3,"Walkup",82654.81,144645.91,112587.42,197027.99,142474.38,249330.17,187699.14,328473.5,232498.89,406873.06,261893.16,458313.03,290909.65000000002,509091.89]
[5,2022,"Region V - Midwest","WISCONSIN","WI","SUPERIOR",4,"Elevator",89564.7,143303.51999999999,125390.58,200624.93,161216.46,257946.34,214955.28,343928.45,268694.09999999998,429910.57,304519.98,487231.98,340345.86,544553.39]
[5,2022,"Region V - Midwest","WISCONSIN","WI","WAUSAU",1,"Detached/Semi-Detached",111434.53,195010.42,144574.84,253005.97,172790.94,302384.14,205974.09,360454.65,242438.09,424266.66,265837.77,465216.1,288475.28999999998,504831.77]
[5,2022,"Region V - Midwest","WISCONSIN","WI","WAUSAU",2,"Row House",87336.74,152839.29999999999,114423.52,200241.16,138634.99,242611.23,169649.8,296887.15000000002,201260.53,352205.93,221786.59,388126.54,240972.9,421702.57]
[5,2022,"Region V - Midwest","WISCONSIN","WI","WAUSAU",3,"Walkup",83301.75,145778.07,113552.19,198716.33,143757.82999999999,251576.21,189453.17,331543.05,234731.53,410780.17,264453.78000000003,462794.11,293805.37,514159.4]
[5,2022,"Region V - Midwest","WISCONSIN","WI","WAUSAU",4,"Elevator",89685.42,143496.68,125559.59,200895.35,161433.76,258294.02,215245.01,344392.02,269056.26,430490.03,304930.43,487888.7,340804.6,545287.37]
[6,2022,"Region VI - Midsouth","ARKANSAS","AR","FAYETTEVILLE",1,"Detached/Semi-Detached",94653.759999999995,165644.07999999999,122901.01,215076.76,146969.45000000001,257196.53,175311.95,306795.90999999997,206422.61,361239.57,226389.23,396181.16,245745.88,430055.29]
[6,2022,"Region VI - Midsouth","ARKANSAS","AR","FAYETTEVILLE",2,"Row House",73568.2,128744.34,96518.6,168907.55,117082.99,204895.23,143528.19,251174.34,170392.24,298186.42,187844.45,328727.78999999998,204181.28,357317.24]
[6,2022,"Region VI - Midsouth","ARKANSAS","AR","FAYETTEVILLE",3,"Walkup",69698.33,121972.08,94891.18,166059.57,120044.84,210078.48,158113.85,276699.23,195817.99,342681.47,220548.67,385960.18,244955.04,428671.31]
[6,2022,"Region VI - Midsouth","ARKANSAS","AR","FAYETTEVILLE",4,"Elevator",75856.47,121370.35,106199.05,169918.49,136541.64000000001,218466.63,182055.52,291288.84000000003,227569.4,364111.05,257911.99,412659.19,288254.58,461207.33]
[6,2022,"Region VI - Midsouth","ARKANSAS","AR","FORT SMITH",1,"Detached/Semi-Detached",94651.54,165640.19,122605.14,214559,146368.38,256144.67,174240.32,304920.55,204936.36,358638.63,224630.01,393102.52,243601.3,426302.28]
[6,2022,"Region VI - Midsouth","ARKANSAS","AR","FORT SMITH",2,"Row House",75419.649999999994,131984.39000000001,98542.07,172448.62,119109.31,208441.29,145250.74,254188.79999999999,172073.49,301128.61,189473.78,331579.12,205690.74,359958.79]
[6,2022,"Region VI - Midsouth","ARKANSAS","AR","FORT SMITH",3,"Walkup",72879.73,127539.53,99581.32,174267.3,126247.16,220932.52,166554.67000000001,291470.67,206529.39,361426.44,232809.45,407416.53,258793.69,452888.95]
[6,2022,"Region VI - Midsouth","ARKANSAS","AR","FORT SMITH",4,"Elevator",76826.47,122922.36,107557.06,172091.31,138287.65,221260.25,184383.54,295013.67,230479.42,368767.08,261210.01,417936.03,291940.59999999998,467104.97]
[6,2022,"Region VI - Midsouth","ARKANSAS","AR","HOT SPRINGS",1,"Detached/Semi-Detached",92929.07,162625.87,120649.09,211135.92,144265.96,252465.43,172071.94,301125.90000000002,202598.04,354546.57,222189.21,388831.11,241176.7,422059.22]
[6,2022,"Region VI - Midsouth","ARKANSAS","AR","HOT SPRINGS",2,"Row House",72306.92,126537.12,94846.52,165981.41,115036.35,201313.61,140986.74,246726.79,167359.54999999999,292879.21000000002,184491.56,322860.23,200525.61,350919.81]
[6,2022,"Region VI - Midsouth","ARKANSAS","AR","HOT SPRINGS",3,"Walkup",68564.42,119987.74,93362.75,163384.81,118122.75,206714.81,155593.82,272289.19,192708.05,337239.09,217054.38,379845.16,241083.51,421896.13]
[6,2022,"Region VI - Midsouth","ARKANSAS","AR","HOT SPRINGS",4,"Elevator",74515.820000000007,119225.32,104322.15,166915.45000000001,134128.48000000001,214605.57,178837.98,286140.77,223547.47,357675.96,253353.8,405366.08,283160.13,453056.21]
[6,2022,"Region VI - Midsouth","ARKANSAS","AR","JONESBORO",1,"Detached/Semi-Detached",91932.43,160881.75,119133.71,208483.99,142267.01999999999,248967.29,169419.6,296484.3,199305.46,348784.56,218480.53,382340.94,236973.45,414703.54]
[6,2022,"Region VI - Midsouth","ARKANSAS","AR","JONESBORO",2,"Row House",72932.25,127631.44,95360.55,166880.97,115336.37,201838.65,140779.29999999999,246363.77,166838.54,291967.44,183747.87,321558.78000000003,199519.64,349159.36]
[6,2022,"Region VI - Midsouth","ARKANSAS","AR","JONESBORO",3,"Walkup",70235.11,122911.44,95908.37,167839.64,121546.31,212706.04,160308.26,280539.45,198741.43,347797.5,223998.23,391996.91,248962.79,435684.88]
[6,2022,"Region VI - Midsouth","ARKANSAS","AR","JONESBORO",4,"Elevator",74451.23,119121.97,104231.72,166770.75,134012.21,214419.54,178682.95,285892.71999999997,223353.68,357365.9,253134.17,405014.68,282914.65999999997,452663.47]
[6,2022,"Region VI - Midsouth","ARKANSAS","AR","LITTLE ROCK",1,"Detached/Semi-Detached",100091.97,175160.95,129843.87,227226.76,155172.17000000001,271551.28999999998,184953.37,323668.40999999997,217684.39,380947.69,238688.18,417704.32,259001.58,453252.76]
[6,2022,"Region VI - Midsouth","ARKANSAS","AR","LITTLE ROCK",2,"Row House",78542.990000000005,137450.23000000001,102881.63,180042.85,124628.86,218100.51,152471.07999999999,266824.39,180862.15,316508.76,199296.26,348768.46,216523.47,378916.07]
[6,2022,"Region VI - Midsouth","ARKANSAS","AR","LITTLE ROCK",3,"Walkup",74987.570000000007,131228.25,102237.08,178914.88,129446.53,226531.42,170606.66,298561.65000000002,211393.91,369939.34,238171.09,416799.41,264616.82,463079.44]
[6,2022,"Region VI - Midsouth","ARKANSAS","AR","LITTLE ROCK",4,"Elevator",80606.960000000006,128971.14,112849.74,180559.59,145092.53,232148.05,193456.7,309530.73,241820.88,386913.41,274063.65999999997,438501.87,306306.45,490090.32]
[6,2022,"Region VI - Midsouth","ARKANSAS","AR","TEXARKANA",1,"Detached/Semi-Detached",92596.11,162043.20000000001,120045.34,210079.35,143399.29,250948.76,170830.62,298953.58,201005.1,351758.92,220366.58,385641.51,239060.76,418356.32]
[6,2022,"Region VI - Midsouth","ARKANSAS","AR","TEXARKANA",2,"Row House",73132.52,127981.9,95692.35,167461.62,115811.8,202670.64,141491.76999999999,247610.6,167746.29999999999,293556.02,184786.78,323376.86,200693.44,351213.51]
[6,2022,"Region VI - Midsouth","ARKANSAS","AR","TEXARKANA",3,"Walkup",70181.78,122818.12,95774.67,167605.67000000001,121331.37,212329.91,159978.91,279963.09000000003,198289.65,347006.88,223455.92,391047.86,248322.82,434564.93]
[6,2022,"Region VI - Midsouth","ARKANSAS","AR","TEXARKANA",4,"Elevator",74817.63,119708.2,104744.68,167591.49,134671.73000000001,215474.77,179562.3,287299.69,224452.88,359124.61,254379.93,407007.9,284306.98,454891.18]
[6,2022,"Region VI - Midsouth","ARKANSAS","AR","WEST MEMPHIS",1,"Detached/Semi-Detached",99561.47,174232.57,129173.73,226054.03,154386.56,270176.48,184038.89,322068.05,216621.93,379088.38,237531.19,415679.59,257760.64000000001,451081.13]
[6,2022,"Region VI - Midsouth","ARKANSAS","AR","WEST MEMPHIS",2,"Row House",78012.479999999996,136521.85,102211.49,178870.11,123843.26,216725.7,151556.59,265224.03000000003,179799.69,314649.45,198139.27,346743.73,215282.54,376744.44]
[6,2022,"Region VI - Midsouth","ARKANSAS","AR","WEST MEMPHIS",3,"Walkup",74393.960000000006,130189.42,101406.01,177460.52,128378.02,224661.53,169181.98,296068.46000000002,209613.05,366822.84,236152.79,413267.38,262361.07,459131.87]
[6,2022,"Region VI - Midsouth","ARKANSAS","AR","WEST MEMPHIS",4,"Elevator",80119.839999999997,128191.74,112167.77,179468.44,144215.71,230745.14,192287.61,307660.18,240359.52,384575.23,272407.45,435851.93,304455.39,487128.63]
[6,2022,"Region VI - Midsouth","LOUISIANA","LA","ALEXANDRIA",1,"Detached/Semi-Detached",95051.08,166339.39000000001,123329.64,215826.87,147408.38,257964.67,175729.91,307527.34000000003,206847.89,361983.81,226817.17,396930.04,246140.43,430745.75]
[6,2022,"Region VI - Midsouth","LOUISIANA","LA","ALEXANDRIA",2,"Row House",74428.94,130250.64,97527.07,170672.37,118178.77,206812.85,144644.70000000001,253128.22,171609.4,300316.45,189119.53,330959.17,205489.34,359606.35]
[6,2022,"Region VI - Midsouth","LOUISIANA","LA","ALEXANDRIA",3,"Walkup",70938.899999999994,124143.07,96687.02,169202.28,122396.81,214194.41,161292.57,282261.99,199831.48,349705.09,225127.6,393973.29,250106.52,437686.4]
[6,2022,"Region VI - Midsouth","LOUISIANA","LA","ALEXANDRIA",4,"Elevator",76464.31,122342.9,107050.03,171280.06,137635.76,220217.22,183514.34,293622.96000000002,229392.93,367028.69,259978.65,415965.85,290564.38,464903.01]
[6,2022,"Region VI - Midsouth","LOUISIANA","LA","BATON ROUGE",1,"Detached/Semi-Detached",98764.6,172838.05,128020.59,224036.04,152907.62,267588.34000000003,182131.34,318729.84000000003,214285.12,374998.96,234916.1,411103.17,254826.96,445947.18]
[6,2022,"Region VI - Midsouth","LOUISIANA","LA","BATON ROUGE",2,"Row House",78142.460000000006,136749.29999999999,102218.02,178881.54,123678.01,216436.52,151046.13,264330.71999999997,179046.63,313331.59000000003,197218.46,345132.3,214175.87,374807.77]
[6,2022,"Region VI - Midsouth","LOUISIANA","LA","BATON ROUGE",3,"Walkup",75094.23,131414.9,102504.48,179382.84,129876.4,227283.71,171265.36,299714.38,212297.47,371520.58,239255.72,418697.51,265896.77,465319.35]
[6,2022,"Region VI - Midsouth","LOUISIANA","LA","BATON ROUGE",4,"Elevator",79874.16,127798.66,111823.82,178918.12,143773.49,230037.59,191697.99,306716.78000000003,239622.48,383395.98,271572.15000000002,434515.44,303521.81,485634.9]
[6,2022,"Region VI - Midsouth","LOUISIANA","LA","LAFAYETTE",1,"Detached/Semi-Detached",99892.2,174811.35,129481.62,226592.83,154652.16,270641.28999999998,184208.58,322365.01,216728.63,379275.1,237594.6,415790.56,257732.01,451031.02]
[6,2022,"Region VI - Midsouth","LOUISIANA","LA","LAFAYETTE",2,"Row House",79038.34,138317.1,103389.13,180930.97,125094.13,218914.73,152774.1,267354.67,181094.2,316914.84000000003,199473.39,349078.44,216624.17,379092.29]
[6,2022,"Region VI - Midsouth","LOUISIANA","LA","LAFAYETTE",3,"Walkup",75957.990000000005,132926.49,103684.23,181447.4,131371.70000000001,229900.48,173237.71,303166,214742.87,375800.01,242012.02,423521.03,268960.40999999997,470680.72]
[6,2022,"Region VI - Midsouth","LOUISIANA","LA","LAFAYETTE",4,"Elevator",80788.039999999994,129260.87,113103.26,180965.22,145418.48000000001,232669.56,193891.3,310226.09000000003,242364.13,387782.61,274679.34000000003,439486.95,306994.56,491191.3]
[6,2022,"Region VI - Midsouth","LOUISIANA","LA","LAKE CHARLES",1,"Detached/Semi-Detached",98034.33,171560.07,126988.21,222229.37,151602.01999999999,265303.53000000003,180472.05,315826.09000000003,212266.89,371467.06,232665.53,407164.68,252316.47,441553.81]
[6,2022,"Region VI - Midsouth","LOUISIANA","LA","LAKE CHARLES",2,"Row House",78107.31,136687.79,102055.38,178596.92,123357.67,215875.93,150434.66,263260.65000000002,178216.21,311878.37,196238.6,343417.54,213035.64,372812.36]
[6,2022,"Region VI - Midsouth","LOUISIANA","LA","LAKE CHARLES",3,"Walkup",75471.03,132074.29999999999,103120.56,180460.98,130733.06,228782.86,172471.73,301825.52,213865.57,374264.75,241078.34,421887.1,267984.59999999998,468973.06]
[6,2022,"Region VI - Midsouth","LOUISIANA","LA","LAKE CHARLES",4,"Elevator",79568.12,127309,111395.37,178232.59,143222.62,229156.19,190963.49,305541.59000000003,238704.36,381926.99,270531.61,432850.59,302358.86,483774.19]
[6,2022,"Region VI - Midsouth","LOUISIANA","LA","MONROE",1,"Detached/Semi-Detached",95714.77,167500.84,124241.28,217422.23,148540.66,259946.15,177140.93,309996.62,208547.53,364958.18,228703.21,400230.62,248227.74,434398.55]
[6,2022,"Region VI - Midsouth","LOUISIANA","LA","MONROE",2,"Row House",74629.2,130601.1,97858.87,171253.02,118654.2,207644.85,145357.17000000001,254375.05,172517.16,301905.03000000003,190158.43,332777.25,206663.14,361660.5]
[6,2022,"Region VI - Midsouth","LOUISIANA","LA","MONROE",3,"Walkup",70885.570000000007,124049.75,96553.31,168968.3,122181.87,213818.27,160963.21,281685.62,199379.69,348914.47,224585.28,393024.23,249466.54,436566.44]
[6,2022,"Region VI - Midsouth","LOUISIANA","LA","MONROE",4,"Elevator",76830.710000000006,122929.14,107562.99,172100.79,138295.28,221272.45,184393.7,295029.93,230492.13,368787.41,261224.41,417959.07,291956.7,467130.72]
[6,2022,"Region VI - Midsouth","LOUISIANA","LA","NEW ORLEANS",1,"Detached/Semi-Detached",102744.49,179802.85,133194.54999999999,233090.46,159100.19,278425.34000000003,189525.83,331670.19,222996.7,390244.23,244473.13,427827.99,265206.24,464110.92]
[6,2022,"Region VI - Midsouth","LOUISIANA","LA","NEW ORLEANS",2,"Row House",81195.5,142092.13,106232.31,185906.54,128556.89,224974.56,157043.53,274826.18,186174.46,325805.3,205081.21,358892.13,222728.13,389774.23]
[6,2022,"Region VI - Midsouth","LOUISIANA","LA","NEW ORLEANS",3,"Walkup",77955.67,136422.42000000001,106392.41,186186.71,134789.1,235880.92,177730.09,311027.65000000002,220298.19,385521.83,248262.61,434459.57,275895.58,482817.26]
[6,2022,"Region VI - Midsouth","LOUISIANA","LA","NEW ORLEANS",4,"Elevator",83042.570000000007,132868.10999999999,116259.59,186015.35,149476.62,239162.6,199302.16,318883.46000000002,249127.7,398604.33,282344.73,451751.57,315561.76,504898.82]
[6,2022,"Region VI - Midsouth","LOUISIANA","LA","SHREVEPORT",1,"Detached/Semi-Detached",99428.29,173999.51,128932.23,225631.41,154039.9,269569.82,183542.36,321199.13,215984.76,377973.34,236802.15,414403.76,256914.28,449599.98]
[6,2022,"Region VI - Midsouth","LOUISIANA","LA","SHREVEPORT",2,"Row House",78342.720000000001,137099.76999999999,102549.83,179462.2,124153.44,217268.52,151758.60999999999,265577.56,179954.39,314920.19,198257.37,346950.39,215349.68,376861.93]
[6,2022,"Region VI - Midsouth","LOUISIANA","LA","SHREVEPORT",3,"Walkup",75040.899999999994,131321.57999999999,102370.78,179148.87,129661.47,226907.57,170936.02,299138.03000000003,211845.7,370729.97,238713.41,417748.47,265256.81,464199.41]
[6,2022,"Region VI - Midsouth","LOUISIANA","LA","SHREVEPORT",4,"Elevator",80240.56,128384.9,112336.79,179738.86,144433.01,231092.82,192577.35,308123.77,240721.69,385154.71,272817.90999999997,436508.67,304914.14,487862.63]
[6,2022,"Region VI - Midsouth","NEW MEXICO","NM","ALBUQUERQUE",1,"Detached/Semi-Detached",100489.29,175856.27,130272.51,227976.88,155611.10999999999,272319.44,185371.34,324399.84000000003,218109.68,381691.95,239116.13,418453.22,259396.14,453943.24]
[6,2022,"Region VI - Midsouth","NEW MEXICO","NM","ALBUQUERQUE",2,"Row House",79403.73,138956.53,103890.1,181807.67,125724.65,220018.14,153587.59,268778.28000000003,182079.31,318638.8,200571.34,350999.85,217831.54,381205.19]
[6,2022,"Region VI - Midsouth","NEW MEXICO","NM","ALBUQUERQUE",3,"Walkup",76228.14,133399.25,104032.91,182057.60000000001,131798.5,230647.37,173785.38,304124.42,215407.41,376962.96,242750.02,424812.53,269768.3,472094.53]
[6,2022,"Region VI - Midsouth","NEW MEXICO","NM","ALBUQUERQUE",4,"Elevator",81214.8,129943.69,113700.73,181921.17,146186.65,233898.64,194915.53,311864.86,243644.41,389831.07,276130.34000000003,441808.54,308616.26,493786.02]
[6,2022,"Region VI - Midsouth","NEW MEXICO","NM","CLOVIS",1,"Detached/Semi-Detached",99494.88,174116.03,129052.98,225842.72,154213.23000000001,269873.15000000002,183790.62,321633.59000000003,216303.35,378530.85,237166.67,415041.67,257337.46,450340.55]
[6,2022,"Region VI - Midsouth","NEW MEXICO","NM","CLOVIS",2,"Row House",78177.600000000006,136810.79999999999,102380.66,179166.15,123998.35,216997.11,151657.60000000001,265400.78999999998,179877.04,314784.81,198198.32,346847.05,215316.1,376803.18]
[6,2022,"Region VI - Midsouth","NEW MEXICO","NM","CLOVIS",3,"Walkup",74717.429999999993,130755.5,101888.39,178304.69,129019.74,225784.54,170058.99,297603.23,210729.37,368776.4,237433.09,415507.92,263808.93,461665.63]
[6,2022,"Region VI - Midsouth","NEW MEXICO","NM","CLOVIS",4,"Elevator",80180.2,128288.32000000001,112252.28,179603.65,144324.35999999999,230918.98,192432.48,307891.96999999997,240540.6,384864.96,272612.68,436180.29,304684.76,487495.62]
[6,2022,"Region VI - Midsouth","NEW MEXICO","NM","FARMINGTON",1,"Detached/Semi-Detached",100555.89,175972.8,130393.26,228188.2,155784.44,272622.77,185619.6,324834.31,218428.27,382249.48,239480.65,419091.14,259819.33,454683.82]
[6,2022,"Region VI - Midsouth","NEW MEXICO","NM","FARMINGTON",2,"Row House",79238.61,138667.57,103720.93,181511.63,125569.56,219746.73,153486.57999999999,268601.51,182001.96,318503.44,200512.3,350896.53,217797.97,381146.45]
[6,2022,"Region VI - Midsouth","NEW MEXICO","NM","FARMINGTON",3,"Walkup",75904.67,132833.17000000001,103550.53,181213.43,131156.76999999999,229524.35,172908.37,302589.64,214291.09,375009.41,241469.71,422571.99,268320.44,469560.78]
[6,2022,"Region VI - Midsouth","NEW MEXICO","NM","FARMINGTON",4,"Elevator",81154.44,129847.11,113616.22,181785.96,146078,233724.79999999999,194770.67,311633.07,243463.33,389541.34,275925.11,441480.18,308386.89,493419.03]
[6,2022,"Region VI - Midsouth","NEW MEXICO","NM","GALLUP",1,"Detached/Semi-Detached",98167.51,171793.14,127229.71,222651.99,151948.68,265910.2,180968.58,316695.02,212904.07,372582.12,233394.58,408440.52,253162.84,443034.97]
[6,2022,"Region VI - Midsouth","NEW MEXICO","NM","GALLUP",2,"Row House",77777.070000000007,136109.88,101717.05,178004.84,123047.5,215333.12,150232.65,262907.13,178061.51,311607.65000000002,196120.51,343210.89,212968.5,372694.88]
[6,2022,"Region VI - Midsouth","NEW MEXICO","NM","GALLUP",3,"Walkup",74824.08,130942.14,102155.8,178772.64,129449.61,226536.83,170717.69,298755.96000000002,211632.94,370357.64,238517.73,417406.02,265088.88,463905.55]
[6,2022,"Region VI - Midsouth","NEW MEXICO","NM","GALLUP",4,"Elevator",79447.399999999994,127115.84,111226.36,177962.18,143005.32,228808.52,190673.76,305078.02,238342.2,381347.53,270121.15999999997,432193.86,301900.12,483040.2]
[6,2022,"Region VI - Midsouth","NEW MEXICO","NM","LAS CRUCES",1,"Detached/Semi-Detached",97239.679999999993,170169.44,126130.93,220729.13,150724.14000000001,263767.24,179636.13,314363.21999999997,211416.32000000001,369978.56,231809.65,405666.89,251527.34,440172.85]
[6,2022,"Region VI - Midsouth","NEW MEXICO","NM","LAS CRUCES",2,"Row House",76385.83,133675.20000000001,100038.44,175067.28,121166.1,212040.68,148201.65,259352.88,175781.89,307618.31,193688.44,338954.77,210419.5,368234.13]
[6,2022,"Region VI - Midsouth","NEW MEXICO","NM","LAS CRUCES",3,"Walkup",72989.899999999994,127732.32,99528.9,174175.57,126029.13,220550.99,166114.29,290700,205838.58,360217.52,231920.5,405860.87,257681.65,450942.89]
[6,2022,"Region VI - Midsouth","NEW MEXICO","NM","LAS CRUCES",4,"Elevator",78352.429999999993,125363.9,109693.41,175509.45,141034.38,225655.01,188045.84,300873.34999999998,235057.3,376091.69,266398.27,426237.25,297739.25,476382.8]
[6,2022,"Region VI - Midsouth","NEW MEXICO","NM","ROSWELL",1,"Detached/Semi-Detached",100091.97,175160.95,129843.87,227226.76,155172.17000000001,271551.28999999998,184953.37,323668.40999999997,217684.39,380947.69,238688.18,417704.32,259001.58,453252.76]
[6,2022,"Region VI - Midsouth","NEW MEXICO","NM","ROSWELL",2,"Row House",78542.990000000005,137450.23000000001,102881.63,180042.85,124628.86,218100.51,152471.07999999999,266824.39,180862.15,316508.76,199296.26,348768.46,216523.47,378916.07]
[6,2022,"Region VI - Midsouth","NEW MEXICO","NM","ROSWELL",3,"Walkup",74987.570000000007,131228.25,102237.08,178914.88,129446.53,226531.42,170606.66,298561.65000000002,211393.91,369939.34,238171.09,416799.41,264616.82,463079.44]
[6,2022,"Region VI - Midsouth","NEW MEXICO","NM","ROSWELL",4,"Elevator",80606.960000000006,128971.14,112849.74,180559.59,145092.53,232148.05,193456.7,309530.73,241820.88,386913.41,274063.65999999997,438501.87,306306.45,490090.32]
[6,2022,"Region VI - Midsouth","NEW MEXICO","NM","SANTA FE",1,"Detached/Semi-Detached",100489.29,175856.27,130272.51,227976.88,155611.10999999999,272319.44,185371.34,324399.84000000003,218109.68,381691.95,239116.13,418453.22,259396.14,453943.24]
[6,2022,"Region VI - Midsouth","NEW MEXICO","NM","SANTA FE",2,"Row House",79403.73,138956.53,103890.1,181807.67,125724.65,220018.14,153587.59,268778.28000000003,182079.31,318638.8,200571.34,350999.85,217831.54,381205.19]
[6,2022,"Region VI - Midsouth","NEW MEXICO","NM","SANTA FE",3,"Walkup",76228.14,133399.25,104032.91,182057.60000000001,131798.5,230647.37,173785.38,304124.42,215407.41,376962.96,242750.02,424812.53,269768.3,472094.53]
[6,2022,"Region VI - Midsouth","NEW MEXICO","NM","SANTA FE",4,"Elevator",81214.8,129943.69,113700.73,181921.17,146186.65,233898.64,194915.53,311864.86,243644.41,389831.07,276130.34000000003,441808.54,308616.26,493786.02]
[6,2022,"Region VI - Midsouth","OKLAHOMA","OK","ARDMORE",1,"Detached/Semi-Detached",96112.09,168196.15,124669.91,218172.35,148979.59,260714.29,177558.88,310728.05,208972.81,365702.42,229131.15,400979.51,248622.29,435089.01]
[6,2022,"Region VI - Midsouth","OKLAHOMA","OK","ARDMORE",2,"Row House",75489.94,132107.4,98867.34,173017.84,119749.98,209562.47,146473.68,256328.93,173734.32,304035.06,191433.5,335008.63,207971.20000000001,363949.61]
[6,2022,"Region VI - Midsouth","OKLAHOMA","OK","ARDMORE",3,"Walkup",72126.13,126220.73,98349.15,172111.01,124533.83,217934.21,164141.93,287248.39,203393.19,355938.08,229164.2,401037.35,254618.01,445581.52]
[6,2022,"Region VI - Midsouth","OKLAHOMA","OK","ARDMORE",4,"Elevator",77438.55,123901.69,108413.97,173462.36,139389.39000000001,223023.03,185852.53,297364.05,232315.66,371705.06,263291.08,421265.73,294266.5,470826.41]
[6,2022,"Region VI - Midsouth","OKLAHOMA","OK","ENID",1,"Detached/Semi-Detached",95381.81,166918.17000000001,123637.53,216365.67,147673.99,258429.48,175899.6,307824.3,206954.58,362170.52,226880.58,397041.02,246111.8,430695.65]
[6,2022,"Region VI - Midsouth","OKLAHOMA","OK","ENID",2,"Row House",75454.789999999994,132045.89000000001,98704.7,172733.23,119429.65,209001.88,145862.21,255258.86,172903.91,302581.83,190453.64,333293.88,206830.97,361954.2]
[6,2022,"Region VI - Midsouth","OKLAHOMA","OK","ENID",3,"Walkup",72502.929999999993,126880.13,98965.23,173189.15,125390.49,219433.36,165348.29999999999,289359.52,204961.29,358682.26,230986.82,404226.93,256705.85,449235.23]
[6,2022,"Region VI - Midsouth","OKLAHOMA","OK","ENID",4,"Elevator",77132.509999999995,123412.02,107985.52,172776.83,138838.51999999999,222141.64,185118.03,296188.86,231397.54,370236.07,262250.55,419600.88,293103.55,468965.69]
[6,2022,"Region VI - Midsouth","OKLAHOMA","OK","LAWTON",1,"Detached/Semi-Detached",94121.03,164711.79999999999,121935,213386.25,145582.78,254769.86,173325.82,303320.19,203873.89,356779.31,223473.02,391077.78,242360.36,424130.64]
[6,2022,"Region VI - Midsouth","OKLAHOMA","OK","LAWTON",2,"Row House",74889.14,131056,97871.93,171275.87,118323.7,207066.47,144336.25,252588.43,171011.03,299269.3,188316.79,329554.38,204449.8,357787.14]
[6,2022,"Region VI - Midsouth","OKLAHOMA","OK","LAWTON",3,"Walkup",72286.11,126500.69,98750.25,172812.93,125178.64,219062.61,165129.98000000001,288977.46000000002,204748.53,358309.93,230791.13,403884.48,256537.92,448941.37]
[6,2022,"Region VI - Midsouth","OKLAHOMA","OK","LAWTON",4,"Elevator",76339.350000000006,122142.96,106875.09,171000.15,137410.82999999999,219857.33,183214.44,293143.11,229018.05,366428.89,259553.79,415286.07,290089.53000000003,464143.26]
[6,2022,"Region VI - Midsouth","OKLAHOMA","OK","OKLAHOMA CITY",1,"Detached/Semi-Detached",101219.57,177134.25,131304.89000000001,229783.56,156916.71,274604.25,187030.62,327303.59000000003,220127.91,385223.84,241366.69,422391.71,261906.63,458336.61]
[6,2022,"Region VI - Midsouth","OKLAHOMA","OK","OKLAHOMA CITY",2,"Row House",79438.880000000005,139018.03,104052.73,182092.29,126044.99,220578.73,154199.04999999999,269848.34999999998,182909.73,320092.02,201551.2,352714.61,218971.77,383200.6]
[6,2022,"Region VI - Midsouth","OKLAHOMA","OK","OKLAHOMA CITY",3,"Walkup",75851.34,132739.85,103416.83,180979.45,130941.84,229148.21,172579.02,302013.28000000003,213839.31,374218.79,240927.4,421622.95,267680.46999999997,468440.83]
[6,2022,"Region VI - Midsouth","OKLAHOMA","OK","OKLAHOMA CITY",4,"Elevator",81520.84,130433.35,114129.18,182606.69,146737.51999999999,234780.03,195650.03,313040.05,244562.53,391300.06,277170.87,443473.4,309779.21000000002,495646.74]
[6,2022,"Region VI - Midsouth","OKLAHOMA","OK","TULSA",1,"Detached/Semi-Detached",96509.41,168891.46,125098.55,218922.46,149418.53,261482.43,177976.84,311459.48,209398.09,366446.66,229559.08,401728.4,249016.85,435779.49]
[6,2022,"Region VI - Midsouth","OKLAHOMA","OK","TULSA",2,"Row House",76350.679999999993,133613.69,99875.81,174782.66,120845.77,211480.09,147590.18,258282.81,174951.48,306165.08,192708.58,337240.01,209279.27,366238.71999999997]
[6,2022,"Region VI - Midsouth","OKLAHOMA","OK","TULSA",3,"Walkup",73366.7,128391.72,100144.98,175253.71,126885.79,222050.14,167320.65,292811.14,207406.68,362961.69,233743.12,409050.45,259769.48,454596.6]
[6,2022,"Region VI - Midsouth","OKLAHOMA","OK","TULSA",4,"Elevator",78046.39,124874.23,109264.95,174823.93,140483.51,224773.62,187311.35,299698.15999999997,234139.18,374622.7,265357.74,424572.39,296576.3,474522.09]
[6,2022,"Region VI - Midsouth","TEXAS","TX","ABILENE",1,"Detached/Semi-Detached",97703.59,170981.29,126680.32000000001,221690.56,151336.41,264838.71000000002,180302.35,315529.12,212160.19,371280.33,232602.11,407053.7,252345.09,441603.91]
[6,2022,"Region VI - Midsouth","TEXAS","TX","ABILENE",2,"Row House",77081.45,134892.54,100877.75,176536.06,122106.8,213686.89,149217.14000000001,261130,176921.7,309612.96999999997,194904.47,341082.82,211694,370464.5]
[6,2022,"Region VI - Midsouth","TEXAS","TX","ABILENE",3,"Walkup",73906.990000000005,129337.23,100842.34,176474.1,127739.37,223543.9,168415.99,294727.96999999997,208735.75,365287.57,235219.11,411633.43,261385.26,457424.21]
[6,2022,"Region VI - Midsouth","TEXAS","TX","ABILENE",4,"Elevator",78899.92,126239.87,110459.88,176735.81,142019.85,227231.76,189359.8,302975.68,236699.75,378719.6,268259.71000000002,429215.55,299819.68,479711.49]
[6,2022,"Region VI - Midsouth","TEXAS","TX","AMARILLO",1,"Detached/Semi-Detached",98367.28,172142.74,127591.96,223285.93,152468.68,266820.2,181713.38,317998.40999999997,213859.84,374254.71,234488.16,410354.29,254432.41,445256.71]
[6,2022,"Region VI - Midsouth","TEXAS","TX","AMARILLO",2,"Row House",77281.72,135243,101209.55,177116.72,122582.23,214518.9,149929.62,262376.84000000003,177829.47,311201.57,195943.38,342900.92,212867.81,372518.66]
[6,2022,"Region VI - Midsouth","TEXAS","TX","AMARILLO",3,"Walkup",73853.66,129243.91,100708.65,176240.13,127524.44,223167.77,168086.64,294151.62,208283.98,364496.96,234676.8,410684.4,260745.29,456304.26]
[6,2022,"Region VI - Midsouth","TEXAS","TX","AMARILLO",4,"Elevator",79266.320000000007,126826.11,110972.84,177556.55,142679.37,228287,190239.16,304382.65999999997,237798.95,380478.33,269505.48,431208.77,301212.01,481939.22]
[6,2022,"Region VI - Midsouth","TEXAS","TX","AUSTIN",1,"Detached/Semi-Detached",94254.22,164944.88,122176.51,213808.89,145929.45000000001,255376.53,173822.36,304189.13,204511.08,357894.38,224202.08,392353.63,243206.75,425611.81]
[6,2022,"Region VI - Midsouth","TEXAS","TX","AUSTIN",2,"Row House",74558.91,130478.09,97533.6,170683.8,118013.53,206523.67,144134.24,252234.91,170856.33,298998.58,188198.71,329347.74,204382.67,357669.68]
[6,2022,"Region VI - Midsouth","TEXAS","TX","AUSTIN",3,"Walkup",71639.17,125368.54,97785.48,171124.59,123895.19,216816.59,163375.95000000001,285907.90999999997,202515.9,354402.82,228230.52,399403.41,253642.21,443873.86]
[6,2022,"Region VI - Midsouth","TEXAS","TX","AUSTIN",4,"Elevator",76218.63,121949.81,106706.08,170729.74,137193.54,219509.66,182924.72,292679.55,228655.9,365849.44,259143.35,414629.36,289630.8,463409.29]
[6,2022,"Region VI - Midsouth","TEXAS","TX","BEAUMONT",1,"Detached/Semi-Detached",99825.61,174694.81,129360.87,226381.51,154478.82999999999,270337.96000000002,183960.31,321930.55,216410.04,378717.57,237230.07999999999,415152.64000000001,257308.82,450290.44]
[6,2022,"Region VI - Midsouth","TEXAS","TX","BEAUMONT",2,"Row House",79203.460000000006,138606.06,103558.29,181227.01,125249.22,219186.14,152875.10999999999,267531.44,181171.55,317050.2,199532.43,349181.76,216657.73,379151.03]
[6,2022,"Region VI - Midsouth","TEXAS","TX","BEAUMONT",3,"Walkup",76281.460000000006,133492.56,104166.61,182291.57,132013.43,231023.5,174114.73,304700.78000000003,215859.18,377753.57,243292.32,425761.57,270408.27,473214.47]
[6,2022,"Region VI - Midsouth","TEXAS","TX","BEAUMONT",4,"Elevator",80848.399999999994,129357.45,113187.76,181100.42,145527.12,232843.4,194036.17,310457.87,242545.21,388072.34,274884.57,439815.32,307223.93,491558.29]
[6,2022,"Region VI - Midsouth","TEXAS","TX","CORPUS CHRISTI",1,"Detached/Semi-Detached",99892.2,174811.35,129481.62,226592.83,154652.16,270641.28999999998,184208.58,322365.01,216728.63,379275.1,237594.6,415790.56,257732.01,451031.02]
[6,2022,"Region VI - Midsouth","TEXAS","TX","CORPUS CHRISTI",2,"Row House",79038.34,138317.1,103389.13,180930.97,125094.13,218914.73,152774.1,267354.67,181094.2,316914.84000000003,199473.39,349078.44,216624.17,379092.29]
[6,2022,"Region VI - Midsouth","TEXAS","TX","CORPUS CHRISTI",3,"Walkup",75957.990000000005,132926.49,103684.23,181447.4,131371.70000000001,229900.48,173237.71,303166,214742.87,375800.01,242012.02,423521.03,268960.40999999997,470680.72]
[6,2022,"Region VI - Midsouth","TEXAS","TX","CORPUS CHRISTI",4,"Elevator",80788.039999999994,129260.87,113103.26,180965.22,145418.48000000001,232669.56,193891.3,310226.09000000003,242364.13,387782.61,274679.34000000003,439486.95,306994.56,491191.3]
[6,2022,"Region VI - Midsouth","TEXAS","TX","DALLAS",1,"Detached/Semi-Detached",99428.29,173999.51,128932.23,225631.41,154039.9,269569.82,183542.36,321199.13,215984.76,377973.34,236802.15,414403.76,256914.28,449599.98]
[6,2022,"Region VI - Midsouth","TEXAS","TX","DALLAS",2,"Row House",78342.720000000001,137099.76999999999,102549.83,179462.2,124153.44,217268.52,151758.60999999999,265577.56,179954.39,314920.19,198257.37,346950.39,215349.68,376861.93]
[6,2022,"Region VI - Midsouth","TEXAS","TX","DALLAS",3,"Walkup",75040.899999999994,131321.57999999999,102370.78,179148.87,129661.47,226907.57,170936.02,299138.03000000003,211845.7,370729.97,238713.41,417748.47,265256.81,464199.41]
[6,2022,"Region VI - Midsouth","TEXAS","TX","DALLAS",4,"Elevator",80240.56,128384.9,112336.79,179738.86,144433.01,231092.82,192577.35,308123.77,240721.69,385154.71,272817.90999999997,436508.67,304914.14,487862.63]
[6,2022,"Region VI - Midsouth","TEXAS","TX","EL PASO",1,"Detached/Semi-Detached",96576,169008,125219.3,219133.77,149591.87,261785.76,178225.11,311893.94,209716.68,367004.19,229923.61,402366.32,249440.04,436520.07]
[6,2022,"Region VI - Midsouth","TEXAS","TX","EL PASO",2,"Row House",76185.56,133324.73000000001,99706.64,174486.62,120690.68,211208.68,147489.17000000001,258106.05,174874.13,306029.71999999997,192649.54,337136.69,209245.7,366179.98]
[6,2022,"Region VI - Midsouth","TEXAS","TX","EL PASO",3,"Walkup",73043.22,127825.64,99662.6,174409.54,126244.07,220927.12,166443.63,291276.36,206290.36,361008.14,232462.81,406809.92,258321.62,452062.84]
[6,2022,"Region VI - Midsouth","TEXAS","TX","EL PASO",4,"Elevator",77986.03,124777.66,109180.45,174688.72,140374.85999999999,224599.78,187166.48,299466.38,233958.1,374332.97,265152.52,424244.03,296346.93,474155.09]
[6,2022,"Region VI - Midsouth","TEXAS","TX","FORT WORTH",1,"Detached/Semi-Detached",98300.69,172026.2,127471.2,223074.61,152295.35,266516.86,181465.11,317563.93,213541.24,373697.17,234123.63,409716.35,254009.21,444516.11]
[6,2022,"Region VI - Midsouth","TEXAS","TX","FORT WORTH",2,"Row House",77446.83,135531.96,101378.72,177412.75,122737.31,214790.3,150030.63,262553.59999999998,177906.81,311336.92,196002.42,343004.23,212901.36,372577.39]
[6,2022,"Region VI - Midsouth","TEXAS","TX","FORT WORTH",3,"Walkup",74177.13,129809.99,101191.03,177084.3,128166.16,224290.78,168963.65,295686.39,209400.29,366450.51,235957.1,412924.93,262193.15000000002,458838.01]
[6,2022,"Region VI - Midsouth","TEXAS","TX","FORT WORTH",4,"Elevator",79326.679999999993,126922.68,111057.35,177691.76,142788.01999999999,228460.83,190384.02,304614.44,237980.03,380768.05,269710.7,431537.12,301441.37,482306.2]
[6,2022,"Region VI - Midsouth","TEXAS","TX","GALVESTON",1,"Detached/Semi-Detached",94984.49,166222.85999999999,123208.89,215615.56,147235.04999999999,257661.34,175481.64,307092.87,206529.3,361426.28,226452.64,396292.13,245717.24,430005.18]
[6,2022,"Region VI - Midsouth","TEXAS","TX","GALVESTON",2,"Row House",74594.05,130539.6,97696.23,170968.41,118333.86,207084.26,144745.71,253304.98,171686.75,300451.81,189178.57,331062.5,205522.91,359665.09]
[6,2022,"Region VI - Midsouth","TEXAS","TX","GALVESTON",3,"Walkup",71262.37,124709.15,97169.4,170046.45,123038.53,215317.43,162169.57999999999,283796.77,200947.8,351658.65,226407.9,396213.83,251554.38,440220.15999999997]
[6,2022,"Region VI - Midsouth","TEXAS","TX","GALVESTON",4,"Elevator",76524.67,122439.48,107134.54,171415.27,137744.41,220391.06,183659.21,293854.74,229574.01,367318.43,260183.88,416294.22,290793.75,465270.01]
[6,2022,"Region VI - Midsouth","TEXAS","TX","HOUSTON",1,"Detached/Semi-Detached",98234.1,171909.67,127350.46,222863.3,152122.01999999999,266213.53000000003,181216.85,317129.48,213222.66,373139.65,233759.11,409078.44,253586.03,443775.55]
[6,2022,"Region VI - Midsouth","TEXAS","TX","HOUSTON",2,"Row House",77611.95,135820.92000000001,101547.89,177708.79999999999,122892.41,215061.71,150131.64000000001,262730.37,177984.16,311472.28999999998,196061.47,343107.57,212934.94,372636.14]
[6,2022,"Region VI - Midsouth","TEXAS","TX","HOUSTON",3,"Walkup",74500.61,130376.07,101673.41,177928.47,128807.89,225413.81,169840.68,297221.19,210516.62,368404.08,237237.42,415165.48,263641.02,461371.79]
[6,2022,"Region VI - Midsouth","TEXAS","TX","HOUSTON",4,"Elevator",79387.039999999994,127019.26,111141.86,177826.97,142896.67000000001,228634.68,190528.89,304846.24,238161.12,381057.79,269915.93,431865.5,301670.75,482673.21]
[6,2022,"Region VI - Midsouth","TEXAS","TX","LAREDO",1,"Detached/Semi-Detached",90074.559999999998,157630.47,116640.3,204120.52,139216.87,243629.52,165683.07,289945.37,194843.72,340976.51,213551.46,373715.05,231557.9,405226.32]
[6,2022,"Region VI - Midsouth","TEXAS","TX","LAREDO",2,"Row House",72001.22,126002.13,94026.81,164546.91,113599.91,198799.84,138439.85,242269.74,163960.54999999999,286930.96000000002,180513.07,315897.88,195931.1,342879.42]
[6,2022,"Region VI - Midsouth","TEXAS","TX","LAREDO",3,"Walkup",69748.14,122059.25,95344.7,166853.23000000001,120907.67,211588.42,159542.26999999999,279198.96999999997,197864.13,346262.23,223064.55,390362.96,247986.98,433977.21]
[6,2022,"Region VI - Midsouth","TEXAS","TX","LAREDO",4,"Elevator",73231.3,117170.09,102523.83,164038.12,131816.35,210906.16,175755.13,281208.21000000002,219693.91,351510.26,248986.43,398378.3,278278.96000000002,445246.34]
[6,2022,"Region VI - Midsouth","TEXAS","TX","LONGVIEW",1,"Detached/Semi-Detached",95781.36,167617.37,124362.03,217633.55,148713.99,260249.48,177389.19,310431.08,208866.12,365515.71,229067.74,400868.54,248650.93,435139.12]
[6,2022,"Region VI - Midsouth","TEXAS","TX","LONGVIEW",2,"Row House",74464.08,130312.14,97689.7,170956.98,118499.11,207373.44,145256.17000000001,254198.29,172439.81,301769.67,190099.39,332673.91999999998,206629.57,361601.76]
[6,2022,"Region VI - Midsouth","TEXAS","TX","LONGVIEW",3,"Walkup",70562.100000000006,123483.67,96070.93,168124.13,121540.14,212695.25,160086.20000000001,280150.84999999998,198263.38,346960.91,223304.97,390783.7,248018.67,434032.68]
[6,2022,"Region VI - Midsouth","TEXAS","TX","LONGVIEW",4,"Elevator",76770.350000000006,122832.56,107478.49,171965.58,138186.63,221098.61,184248.84,294798.14,230311.05,368497.68,261019.19,417630.7,291727.33,466763.73]
[6,2022,"Region VI - Midsouth","TEXAS","TX","LUBBOCK",1,"Detached/Semi-Detached",97173.09,170052.91,126010.18,220517.82,150550.79999999999,263463.90999999997,179387.86,313928.76,211097.73,369421.03,231445.13,405028.97,251104.16,439432.28]
[6,2022,"Region VI - Midsouth","TEXAS","TX","LUBBOCK",2,"Row House",76550.95,133964.16,100207.61,175363.32,121321.19,212312.09,148302.65,259529.65,175859.24,307753.67,193747.48,339058.09,210453.07,368292.87]
[6,2022,"Region VI - Midsouth","TEXAS","TX","LUBBOCK",3,"Walkup",73313.37,128298.4,100011.28,175019.74,126670.86,221674,166991.29999999999,292234.78000000003,206954.9,362171.08,233200.8,408101.41,259129.51,453476.64]
[6,2022,"Region VI - Midsouth","TEXAS","TX","LUBBOCK",4,"Elevator",78412.789999999994,125460.47,109777.91,175644.66,141143.03,225828.85,188190.71,301105.13,235238.38,376381.42,266603.5,426565.61,297968.62,476749.8]
[6,2022,"Region VI - Midsouth","TEXAS","TX","MIDLAND",1,"Detached/Semi-Detached",97503.83,170631.69,126318.07,221056.63,150816.41,263928.71999999997,179557.56,314225.74,211204.43,369607.76,231508.54,405139.95,251075.53,439382.18]
[6,2022,"Region VI - Midsouth","TEXAS","TX","MIDLAND",2,"Row House",77576.81,135759.41,101385.25,177424.19,122572.07,214501.12,149520.17000000001,261660.3,177153.75,310019.07,195081.61,341392.81,211794.7,370640.73]
[6,2022,"Region VI - Midsouth","TEXAS","TX","MIDLAND",3,"Walkup",74877.41,131035.47,102289.5,179006.62,129664.55,226912.96,171047.04000000001,299332.32,212084.72,371148.26,239060.04,418355.07,265728.84999999998,465025.5]
[6,2022,"Region VI - Midsouth","TEXAS","TX","MIDLAND",4,"Elevator",79081,126529.60000000001,110713.4,177141.44,142345.79999999999,227753.28,189794.4,303671.05,237243,379588.81,268875.40000000002,430200.65,300507.8,480812.49]
[6,2022,"Region VI - Midsouth","TEXAS","TX","SAN ANGELO",1,"Detached/Semi-Detached",92596.11,162043.20000000001,120045.34,210079.35,143399.29,250948.76,170830.62,298953.58,201005.1,351758.92,220366.58,385641.51,239060.76,418356.32]
[6,2022,"Region VI - Midsouth","TEXAS","TX","SAN ANGELO",2,"Row House",73132.52,127981.9,95692.35,167461.62,115811.8,202670.64,141491.76999999999,247610.6,167746.29999999999,293556.02,184786.78,323376.86,200693.44,351213.51]
[6,2022,"Region VI - Midsouth","TEXAS","TX","SAN ANGELO",3,"Walkup",70181.78,122818.12,95774.67,167605.67000000001,121331.37,212329.91,159978.91,279963.09000000003,198289.65,347006.88,223455.92,391047.86,248322.82,434564.93]
[6,2022,"Region VI - Midsouth","TEXAS","TX","SAN ANGELO",4,"Elevator",74817.63,119708.2,104744.68,167591.49,134671.73000000001,215474.77,179562.3,287299.69,224452.88,359124.61,254379.93,407007.9,284306.98,454891.18]
[6,2022,"Region VI - Midsouth","TEXAS","TX","SAN ANTONIO",1,"Detached/Semi-Detached",93590.53,163783.43,121264.87,212213.51,144797.17000000001,253395.05,172411.33,301719.83,202811.43,354920,222316.03,389053.05,241119.43,421959.01]
[6,2022,"Region VI - Midsouth","TEXAS","TX","SAN ANTONIO",2,"Row House",74358.64,130127.62,97201.79,170103.14,117538.09,205691.67,143421.76000000001,250988.07,169948.57,297409.99,187159.8,327529.65000000002,203208.87,355615.51]
[6,2022,"Region VI - Midsouth","TEXAS","TX","SAN ANTONIO",3,"Walkup",71692.490000000005,125461.86,97919.18,171358.57,124110.12,217192.72,163705.29,286484.26,202967.67,355193.43,228772.83,400352.45,254282.17,444993.8]
[6,2022,"Region VI - Midsouth","TEXAS","TX","SAN ANTONIO",4,"Elevator",75852.23,121363.57,106193.12,169909,136534.01,218454.42,182045.35,291272.57,227556.69,364090.71,257897.58,412636.14,288238.46999999997,461181.56]
[6,2022,"Region VI - Midsouth","TEXAS","TX","TYLER",1,"Detached/Semi-Detached",93856.9,164249.57,121747.87,213058.77,145490.51,254608.39,173404.4,303457.7,204085.79,357150.14,223774.14,391604.74,242812.19,424921.34]
[6,2022,"Region VI - Midsouth","TEXAS","TX","TYLER",2,"Row House",73698.17,128971.79,96525.13,168918.98,116917.74,204606.05,143017.73000000001,250281.03,169639.18,296868.56,186923.63,327116.36,203074.61,355380.57]
[6,2022,"Region VI - Midsouth","TEXAS","TX","TYLER",3,"Walkup",70398.61,123197.56,95989.65,167981.89,121543.23,212700.65,160197.23000000001,280345.15999999997,198502.41,347379.21,223651.61,391390.31,248490.74,434858.79]
[6,2022,"Region VI - Midsouth","TEXAS","TX","TYLER",4,"Elevator",75610.789999999994,120977.26,105855.11,169368.17,136099.42000000001,217759.08,181465.89,290345.44,226832.37,362931.79,257076.68,411322.7,287321,459713.61]
[6,2022,"Region VI - Midsouth","TEXAS","TX","VICTORIA",1,"Detached/Semi-Detached",90871.43,159024.99,117793.44,206138.52,140695.81,246217.67,167590.62,293283.59000000003,197180.54,345065.95,216166.56,378291.47,234491.59,410360.28]
[6,2022,"Region VI - Midsouth","TEXAS","TX","VICTORIA",2,"Row House",71871.25,125774.68,94020.28,164535.49,113765.16,199089.03,138950.32,243163.06,164713.60999999999,288248.83,181433.9,317509.32,197037.77,344816.1]
[6,2022,"Region VI - Midsouth","TEXAS","TX","VICTORIA",3,"Walkup",69047.87,120833.78,94246.24,164930.91,119409.29,208966.25,157458.89000000001,275553.06,195179.72,341564.51,219961.63,384932.85,244451.29,427789.76]
[6,2022,"Region VI - Midsouth","TEXAS","TX","VICTORIA",4,"Elevator",73476.98,117563.18,102867.78,164588.45000000001,132258.57,211613.72,176344.76,282151.63,220430.96,352689.53,249821.75,399714.8,279212.53999999998,446740.08]
[6,2022,"Region VI - Midsouth","TEXAS","TX","WACO",1,"Detached/Semi-Detached",96973.32,169703.31,125647.94,219883.89,150030.81,262553.92,178643.07,312625.38,210141.97,367748.45,230351.56,403115.22,249834.6,437210.55]
[6,2022,"Region VI - Midsouth","TEXAS","TX","WACO",2,"Row House",77046.31,134831.03,100715.11,176251.45,121786.46,213126.31,148605.68,260059.94,176091.29,308159.76,193924.62,339368.08,210553.77,368469.1]
[6,2022,"Region VI - Midsouth","TEXAS","TX","WACO",3,"Walkup",74283.789999999994,129996.63,101458.43,177552.26,128596.04,225043.07,169622.36,296839.13,210303.86,368031.76,237041.74,414823.04,263473.11,461077.94]
[6,2022,"Region VI - Midsouth","TEXAS","TX","WACO",4,"Elevator",78593.88,125750.21,110031.43,176050.29,141468.98000000001,226350.38,188625.31,301800.5,235781.64,377250.63,267219.19,427550.71,298656.74,477850.79]
[6,2022,"Region VI - Midsouth","TEXAS","TX","WICHITA FALLS",1,"Detached/Semi-Detached",97570.42,170748.23,126438.82,221267.94,150989.75,264232.06,179805.83,314660.2,211523.02,370165.29,231873.07,405777.87,251498.72,440122.76]
[6,2022,"Region VI - Midsouth","TEXAS","TX","WICHITA FALLS",2,"Row House",77411.69,135470.46,101216.08,177128.15,122416.98,214229.71,149419.16,261483.54,177076.4,309883.71000000002,195022.56,341289.49,211761.14,370581.99]
[6,2022,"Region VI - Midsouth","TEXAS","TX","WICHITA FALLS",3,"Walkup",74553.94,130469.39,101807.11,178162.45,129022.83,225789.95,170170.03,297797.55,210968.4,369194.7,237779.73,416114.53,264280.99,462491.74]
[6,2022,"Region VI - Midsouth","TEXAS","TX","WICHITA FALLS",4,"Elevator",79020.639999999999,126433.03,110628.9,177006.24,142237.15,227579.45,189649.54,303439.26,237061.92,379299.08,268670.18,429872.29,300278.43,480445.5]
[7,2022,"Region VII - Midwest","IOWA","IA","BURLINGTON",1,"Detached/Semi-Detached",106790.96,186884.19,138489.26,242356.2,165466.1,289565.68,197168.59,345045.02,232026.88,406047.04,254394.7,445190.73,276008.71999999997,483015.25]
[7,2022,"Region VII - Midwest","IOWA","IA","BURLINGTON",2,"Row House",84083.43,147146.01,110077.43,192635.51,133280.69,233241.2,162939.93,285144.88,193224.94,338143.65,212884.94,372548.64,231246.84,404681.97]
[7,2022,"Region VII - Midwest","IOWA","IA","BURLINGTON",3,"Walkup",80493.64,140863.87,109797.96,192146.43,139060.07999999999,243355.13,183317.8,320806.15000000002,227182.6,397569.55,255989.2,447981.11,284446.53999999998,497781.44]
[7,2022,"Region VII - Midwest","IOWA","IA","BURLINGTON",4,"Elevator",86150.62,137840.99,120610.86,192977.39,155071.10999999999,248113.78,206761.48,330818.37,258451.85,413522.97,292912.09999999998,468659.36,327372.34999999998,523795.76]
[7,2022,"Region VII - Midwest","IOWA","IA","CEDAR RAPIDS",1,"Detached/Semi-Detached",110173.75,192804.06,142872.32000000001,250026.56,170699.73,298724.53000000003,203400.31,355950.55,239357.41,418875.46,262430.21000000002,459252.87,284723.87,498266.77]
[7,2022,"Region VII - Midwest","IOWA","IA","CEDAR RAPIDS",2,"Row House",86771.09,151849.41,113590.75,198783.81,137529.04999999999,240675.83,168123.84,294216.71999999997,199367.66,348893.4,219649.74,384387.05,238591.73,417535.53]
[7,2022,"Region VII - Midwest","IOWA","IA","CEDAR RAPIDS",3,"Walkup",83084.929999999993,145398.63,113337.2,198340.11,143545.98000000001,251205.46,189234.86,331161,234518.77,410407.85,264258.09000000003,462451.66,293637.45,513865.54]
[7,2022,"Region VII - Midwest","IOWA","IA","CEDAR RAPIDS",4,"Elevator",88892.26,142227.62,124449.17,199118.67,160006.07,256009.72,213341.43,341346.29,266676.78000000003,426682.86,302233.69,483573.91,337790.59,540464.96]
[7,2022,"Region VII - Midwest","IOWA","IA","COUNCIL BLUFFS",1,"Detached/Semi-Detached",100091.97,175160.95,129843.87,227226.76,155172.17000000001,271551.28999999998,184953.37,323668.40999999997,217684.39,380947.69,238688.18,417704.32,259001.58,453252.76]
[7,2022,"Region VII - Midwest","IOWA","IA","COUNCIL BLUFFS",2,"Row House",78542.990000000005,137450.23000000001,102881.63,180042.85,124628.86,218100.51,152471.07999999999,266824.39,180862.15,316508.76,199296.26,348768.46,216523.47,378916.07]
[7,2022,"Region VII - Midwest","IOWA","IA","COUNCIL BLUFFS",3,"Walkup",74987.570000000007,131228.25,102237.08,178914.88,129446.53,226531.42,170606.66,298561.65000000002,211393.91,369939.34,238171.09,416799.41,264616.82,463079.44]
[7,2022,"Region VII - Midwest","IOWA","IA","COUNCIL BLUFFS",4,"Elevator",80606.960000000006,128971.14,112849.74,180559.59,145092.53,232148.05,193456.7,309530.73,241820.88,386913.41,274063.65999999997,438501.87,306306.45,490090.32]
[7,2022,"Region VII - Midwest","IOWA","IA","DAVENPORT",1,"Detached/Semi-Detached",116475.42,203831.99,151089.07,264405.88,180554.73,315970.78000000003,215197.57,376595.74,253274.61,443230.57,277708.79999999999,485990.40000000002,301336.46000000002,527338.80000000005]
[7,2022,"Region VII - Midwest","IOWA","IA","DAVENPORT",2,"Row House",91450.8,160038.89000000001,119778.08,209611.65,145085.09,253898.9,177476.19,310583.33,210513.29,368398.26,231963.34,405935.85,252007.04000000001,441012.32]
[7,2022,"Region VII - Midwest","IOWA","IA","DAVENPORT",3,"Walkup",87350.43,152863.26,119102.25,208428.94,150807.56,263913.23,198767.28,347842.73,246293.97,431014.44,277497.28999999998,485620.25,308315.69,539552.46]
[7,2022,"Region VII - Midwest","IOWA","IA","DAVENPORT",4,"Elevator",93828.08,150124.92000000001,131359.31,210174.89,168890.54,270224.86,225187.38,360299.82,281484.23,450374.77,319015.46000000002,510424.74,356546.69,570474.71]
[7,2022,"Region VII - Midwest","IOWA","IA","DES MOINES",1,"Detached/Semi-Detached",105530.18,184677.82,136786.73000000001,239376.78,163374.89000000001,285906.05,194594.81,340540.91,228946.19,400655.83,250987.14,439227.49,272257.28000000003,476450.24]
[7,2022,"Region VII - Midwest","IOWA","IA","DES MOINES",2,"Row House",83517.78,146156.12,109244.66,191178.15,132174.74,231305.8,161413.97,282474.44,191332.06,334831.11,210748.08,368809.14,228865.67,400514.92]
[7,2022,"Region VII - Midwest","IOWA","IA","DES MOINES",3,"Walkup",80276.820000000007,140484.43,109582.98,191770.21,138848.22,242984.38,183099.48,320424.09000000003,226969.84,397197.21,255793.52,447638.65,284278.62,497487.58]
[7,2022,"Region VII - Midwest","IOWA","IA","DES MOINES",4,"Elevator",85357.45,136571.93,119500.44,191200.7,153643.42000000001,245829.47,204857.89,327772.63,256072.36,409715.79,290215.34999999998,464344.56,324358.33,518973.33]
[7,2022,"Region VII - Midwest","IOWA","IA","DUBUQUE",1,"Detached/Semi-Detached",107787.6,188628.3,140004.64000000001,245008.11,167465.03,293063.81,199820.92,349686.61,235319.45,411809.04,258103.36,451680.89,280211.95,490370.92]
[7,2022,"Region VII - Midwest","IOWA","IA","DUBUQUE",2,"Row House",83458.100000000006,146051.68,109563.4,191735.95,132980.66,232716.16,163147.35999999999,285507.89,193745.95,339055.42,213628.62,373850.08,232252.79999999999,406442.41]
[7,2022,"Region VII - Midwest","IOWA","IA","DUBUQUE",3,"Walkup",78822.95,137940.16,107252.34,187691.6,135636.51,237363.9,178603.36,312555.89,221149.22,387011.13,249045.35,435829.35,276567.25,483992.69]
[7,2022,"Region VII - Midwest","IOWA","IA","DUBUQUE",4,"Elevator",86215.21,137944.34,120701.29,193122.07,155187.38,248299.81,206916.51,331066.40999999997,258645.63,413833.02,293131.71999999997,469010.75,327617.8,524188.49]
[7,2022,"Region VII - Midwest","IOWA","IA","FORT DODGE",1,"Detached/Semi-Detached",101485.93,177600.38,131787.89000000001,230628.81,157610.04999999999,275817.58,188023.67999999999,329041.45,221402.27,387453.96,242824.8,424943.4,263599.39,461298.93]
[7,2022,"Region VII - Midwest","IOWA","IA","FORT DODGE",2,"Row House",78778.399999999994,137862.20000000001,103376.07,180908.12,125424.63,219493.1,153795.03,269141.3,182600.33,319550.57,201315.03,352301.31,218837.51,382965.64]
[7,2022,"Region VII - Midwest","IOWA","IA","FORT DODGE",3,"Walkup",74557.45,130475.54,101487.3,177602.77,128374.94,224656.14,169070.95,295874.15999999997,209374.03,366404.55,235806.16,412660.78,261889.02,458305.79]
[7,2022,"Region VII - Midwest","IOWA","IA","FORT DODGE",4,"Elevator",81279.399999999994,130047.03999999999,113791.16,182065.86,146302.92000000001,234084.68,195070.56,312112.90000000002,243838.2,390141.13,276349.96000000002,442159.95,308861.71999999997,494178.76]
[7,2022,"Region VII - Midwest","IOWA","IA","MASON CITY",1,"Detached/Semi-Detached",105732.18,185031.31,137444.84,240528.47,164495.94,287867.90000000002,196411.23,343719.64,231388.19,404929.34,253839.93,444219.87,275671.40999999997,482424.96]
[7,2022,"Region VII - Midwest","IOWA","IA","MASON CITY",2,"Row House",81170.97,142049.20000000001,106713.69,186748.95,129683.15,226945.51,159388.4,278929.69,189418.76,331482.82,208941.61,365647.82,227255.5,397697.13]
[7,2022,"Region VII - Midwest","IOWA","IA","MASON CITY",3,"Walkup",76125,133218.75,103445.69,181029.96,130720.73,228761.28,172027.61,301048.31,212909.47,372591.57,239691.82,419460.68,266096.38,465668.67]
[7,2022,"Region VII - Midwest","IOWA","IA","MASON CITY",4,"Elevator",84206.36,134730.18,117888.91,188622.26,151571.45000000001,242514.33,202095.27,323352.44,252619.09,404190.55,286301.63,458082.62,319984.18,511974.69]
[7,2022,"Region VII - Midwest","IOWA","IA","SIOUX CITY",1,"Detached/Semi-Detached",103274.99,180731.23,133864.68,234263.2,159885.79999999999,279800.15000000002,190440.31,333270.55,224059.16,392103.53,245630.12,429852.72,266447.17,466282.55]
[7,2022,"Region VII - Midwest","IOWA","IA","SIOUX CITY",2,"Row House",81726,143020.51,106902.44,187079.28,129342.5,226349.37,157958.01999999999,276426.53000000003,187236.92,327664.59999999998,206238.2,360916.86,223969.07,391945.86]
[7,2022,"Region VII - Midwest","IOWA","IA","SIOUX CITY",3,"Walkup",78549.289999999994,137461.25,107223.47,187641.08,135857.60999999999,237750.82,179154.77,313520.84999999998,222079.04,388638.33,250280.91,437991.6,278151.33,486764.82]
[7,2022,"Region VII - Midwest","IOWA","IA","SIOUX CITY",4,"Elevator",83529.69,133647.5,116941.56,187106.51,150353.44,240565.51,200471.25,320754.01,250589.07,400942.51,284000.94,454401.51,317412.82,507860.51]
[7,2022,"Region VII - Midwest","IOWA","IA","WATERLOO",1,"Detached/Semi-Detached",106460.23,186305.4,138181.37,241817.39,165200.49,289100.86,196998.89,344748.05,231920.18,405860.31,254331.28,445079.75,276037.34000000003,483065.35]
[7,2022,"Region VII - Midwest","IOWA","IA","WATERLOO",2,"Row House",83057.570000000007,145350.75,108899.79,190574.64,132029.81,231052.17,161722.41,283014.21999999997,191930.43,335878.25,211550.81,370213.92,229905.2,402334.11]
[7,2022,"Region VII - Midwest","IOWA","IA","WATERLOO",3,"Walkup",78929.600000000006,138126.79999999999,107519.74,188159.55,136066.38,238116.17,179262.06,313708.61,222052.78,388592.36,250129.97,437727.45,277847.2,486232.59]
[7,2022,"Region VII - Midwest","IOWA","IA","WATERLOO",4,"Elevator",85482.41,136771.85999999999,119675.38,191480.6,153868.34,246189.35,205157.79,328252.46000000002,256447.23,410315.58,290640.2,465024.32,324833.15999999997,519733.07]
[7,2022,"Region VII - Midwest","KANSAS","KS","DODGE CITY",1,"Detached/Semi-Detached",99030.97,173304.19,128503.59,224881.29,153600.95999999999,268801.67,183124.4,320467.69,215559.47,377229.08,236374.2,413654.86,256519.71,448909.5]
[7,2022,"Region VII - Midwest","KANSAS","KS","DODGE CITY",2,"Row House",77481.98,135593.47,101541.35,177697.37,123057.65,215350.89,150642.1,263623.67,178737.23,312790.15000000002,196982.28,344719,214041.61,374572.81]
[7,2022,"Region VII - Midwest","KANSAS","KS","DODGE CITY",3,"Walkup",73800.34,129150.59,100574.95,176006.15,127309.5,222791.63,167757.29,293575.26,207832.2,363706.34,234134.49,409735.35,260105.32,455184.31]
[7,2022,"Region VII - Midwest","KANSAS","KS","DODGE CITY",4,"Elevator",79632.72,127412.35,111485.8,178377.29,143338.89000000001,229342.23,191118.52,305789.64,238898.15,382237.05,270751.24,433201.99,302604.33,484166.93]
[7,2022,"Region VII - Midwest","KANSAS","KS","FORT SCOTT",1,"Detached/Semi-Detached",102744.49,179802.85,133194.54999999999,233090.46,159100.19,278425.34000000003,189525.83,331670.19,222996.7,390244.23,244473.13,427827.99,265206.24,464110.92]
[7,2022,"Region VII - Midwest","KANSAS","KS","FORT SCOTT",2,"Row House",81195.5,142092.13,106232.31,185906.54,128556.89,224974.56,157043.53,274826.18,186174.46,325805.3,205081.21,358892.13,222728.13,389774.23]
[7,2022,"Region VII - Midwest","KANSAS","KS","FORT SCOTT",3,"Walkup",77955.67,136422.42000000001,106392.41,186186.71,134789.1,235880.92,177730.09,311027.65000000002,220298.19,385521.83,248262.61,434459.57,275895.58,482817.26]
[7,2022,"Region VII - Midwest","KANSAS","KS","FORT SCOTT",4,"Elevator",83042.570000000007,132868.10999999999,116259.59,186015.35,149476.62,239162.6,199302.16,318883.46000000002,249127.7,398604.33,282344.73,451751.57,315561.76,504898.82]
[7,2022,"Region VII - Midwest","KANSAS","KS","HAYS",1,"Detached/Semi-Detached",94784.72,165873.26,122846.64,214981.62,146715.04999999999,256751.34,174736.85,305789.48,205573.54,359753.69,225359.07,394378.37,244447.68,427783.44]
[7,2022,"Region VII - Midwest","KANSAS","KS","HAYS",2,"Row House",75089.41,131406.47,98203.73,171856.53,118799.13,207898.48,145048.73000000001,253835.27,171918.79,300857.89,189355.7,331372.46999999997,205623.6,359841.31]
[7,2022,"Region VII - Midwest","KANSAS","KS","HAYS",3,"Walkup",72232.789999999994,126407.38,98616.55,172578.96,124963.7,218686.48,164800.63,288401.11,204296.75,357519.32,230248.82,402935.44,255897.96,447821.42]
[7,2022,"Region VII - Midwest","KANSAS","KS","HAYS",4,"Elevator",76705.75,122729.21,107388.05,171820.89,138070.35999999999,220912.57,184093.81,294550.09999999998,230117.26,368187.62,260799.56,417279.3,291481.86,466370.98]
[7,2022,"Region VII - Midwest","KANSAS","KS","KANSAS CITY",1,"Detached/Semi-Detached",115878.33,202787.08,150298.19,263021.83,179595.79,314292.64,214034.81,374560.92,251893.56,440813.74,276187.28000000003,483327.75,299672.34000000003,524426.59]
[7,2022,"Region VII - Midwest","KANSAS","KS","KANSAS CITY",2,"Row House",91085.41,159399.47,119277.11,208734.95,144454.57,252795.5,176662.71,309159.74,209528.18,366674.32,230865.4,404014.44,250799.67,438899.43]
[7,2022,"Region VII - Midwest","KANSAS","KS","KANSAS CITY",3,"Walkup",87080.29,152390.5,118753.57,207818.75,150380.76999999999,263166.34999999998,198219.61,346884.32,245629.43,429851.5,276759.28999999998,484328.76,307507.8,538138.66]
[7,2022,"Region VII - Midwest","KANSAS","KS","KANSAS CITY",4,"Elevator",93401.32,149442.10999999999,130761.84,209218.95,168122.37,268995.78999999998,224163.16,358661.06,280203.95,448326.32,317564.46999999997,508103.17,354925,567880.01]
[7,2022,"Region VII - Midwest","KANSAS","KS","LIBERAL",1,"Detached/Semi-Detached",92596.11,162043.20000000001,120045.34,210079.35,143399.29,250948.76,170830.62,298953.58,201005.1,351758.92,220366.58,385641.51,239060.76,418356.32]
[7,2022,"Region VII - Midwest","KANSAS","KS","LIBERAL",2,"Row House",73132.52,127981.9,95692.35,167461.62,115811.8,202670.64,141491.76999999999,247610.6,167746.29999999999,293556.02,184786.78,323376.86,200693.44,351213.51]
[7,2022,"Region VII - Midwest","KANSAS","KS","LIBERAL",3,"Walkup",70181.78,122818.12,95774.67,167605.67000000001,121331.37,212329.91,159978.91,279963.09000000003,198289.65,347006.88,223455.92,391047.86,248322.82,434564.93]
[7,2022,"Region VII - Midwest","KANSAS","KS","LIBERAL",4,"Elevator",74817.63,119708.2,104744.68,167591.49,134671.73000000001,215474.77,179562.3,287299.69,224452.88,359124.61,254379.93,407007.9,284306.98,454891.18]
[7,2022,"Region VII - Midwest","KANSAS","KS","SALINA",1,"Detached/Semi-Detached",99097.56,173420.72,128624.34,225092.6,153774.29,269105.01,183372.66,320902.15999999997,215878.06,377786.61,236738.73,414292.78,256942.9,449650.07]
[7,2022,"Region VII - Midwest","KANSAS","KS","SALINA",2,"Row House",77316.86,135304.51,101372.19,177401.33,122902.56,215079.49,150541.09,263446.90999999997,178659.88,312654.78999999998,196923.24,344615.67,214008.04,374514.07]
[7,2022,"Region VII - Midwest","KANSAS","KS","SALINA",3,"Walkup",73476.87,128584.51,100092.56,175161.98,126667.78,221668.61,166880.28,292040.48,206715.88,361752.79,232854.18,407494.81,258657.46,452650.56]
[7,2022,"Region VII - Midwest","KANSAS","KS","SALINA",4,"Elevator",79572.36,127315.77,111401.3,178242.08,143230.24,229168.39,190973.66,305557.84999999998,238717.07,381947.32,270546.01,432873.63,302374.96000000002,483799.94]
[7,2022,"Region VII - Midwest","KANSAS","KS","TOPEKA",1,"Detached/Semi-Detached",104071.86,182125.75,135017.82,236281.19,161364.74,282388.3,192347.87,336608.77,226395.98,396192.97,248245.22,434429.14,269380.86,471416.51]
[7,2022,"Region VII - Midwest","KANSAS","KS","TOPEKA",2,"Row House",81596.03,142793.06,106895.92,187067.85,129507.75,226638.56,158468.48000000001,277319.84999999998,187989.98,328982.46999999997,207159.03,362528.3,225075.74,393882.55]
[7,2022,"Region VII - Midwest","KANSAS","KS","TOPEKA",3,"Walkup",77849.02,136235.78,106125.01,185718.77,134359.23000000001,235128.65,177071.39,309874.93,219394.63,383940.61,247177.99,432561.48,274615.64,480577.37]
[7,2022,"Region VII - Midwest","KANSAS","KS","TOPEKA",4,"Elevator",83775.37,134040.59,117285.52,187656.83,150795.67000000001,241273.07,201060.89,321697.42,251326.11,402121.78,284836.26,455738.02,318346.40000000002,509354.26]
[7,2022,"Region VII - Midwest","KANSAS","KS","WICHITA",1,"Detached/Semi-Detached",97173.09,170052.91,126010.18,220517.82,150550.79999999999,263463.90999999997,179387.86,313928.76,211097.73,369421.03,231445.13,405028.97,251104.16,439432.28]
[7,2022,"Region VII - Midwest","KANSAS","KS","WICHITA",2,"Row House",76550.95,133964.16,100207.61,175363.32,121321.19,212312.09,148302.65,259529.65,175859.24,307753.67,193747.48,339058.09,210453.07,368292.87]
[7,2022,"Region VII - Midwest","KANSAS","KS","WICHITA",3,"Walkup",73313.37,128298.4,100011.28,175019.74,126670.86,221674,166991.29999999999,292234.78000000003,206954.9,362171.08,233200.8,408101.41,259129.51,453476.64]
[7,2022,"Region VII - Midwest","KANSAS","KS","WICHITA",4,"Elevator",78412.789999999994,125460.47,109777.91,175644.66,141143.03,225828.85,188190.71,301105.13,235238.38,376381.42,266603.5,426565.61,297968.62,476749.8]
[7,2022,"Region VII - Midwest","MISSOURI","MO","CAPE GIRARDEAU",1,"Detached/Semi-Detached",101616.89,177829.56,131733.53,230533.67,157355.65,275372.39,187448.58,328035.02,220553.19,385968.09,241794.63,423140.6,262301.19,459027.08]
[7,2022,"Region VII - Midwest","MISSOURI","MO","CAPE GIRARDEAU",2,"Row House",80299.62,140524.32999999999,105061.2,183857.11,127140.77,222496.35,155315.56,271802.23,184126.88,322222.05,202826.28,354945.99,220279.84,385489.71]
[7,2022,"Region VII - Midwest","MISSOURI","MO","CAPE GIRARDEAU",3,"Walkup",77091.899999999994,134910.82999999999,105212.66,184122.16,133293.79999999999,233264.14,175757.73,307576.03999999998,217852.79999999999,381242.4,245506.31,429636.05,272831.94,477455.9]
[7,2022,"Region VII - Midwest","MISSOURI","MO","CAPE GIRARDEAU",4,"Elevator",82128.69,131405.9,114980.16,183968.26,147831.64000000001,236530.62,197108.85,315374.15999999997,246386.06,394217.7,279237.53000000003,446780.06,312089.01,499342.42]
[7,2022,"Region VII - Midwest","MISSOURI","MO","COLUMBIA",1,"Detached/Semi-Detached",107587.83,188278.69,139642.39000000001,244374.18,166945.04,292153.81,199076.13,348383.22,234363.69,410136.45,257009.79,449767.13,278942.39,488149.18]
[7,2022,"Region VII - Midwest","MISSOURI","MO","COLUMBIA",2,"Row House",83953.46,146918.54999999999,110070.9,192624.07,133445.93,233530.38,163450.38,286038.17,193978,339461.5,213805.75,374160.06,232353.5,406618.63]
[7,2022,"Region VII - Midwest","MISSOURI","MO","COLUMBIA",3,"Walkup",79793.37,139638.39000000001,108699.49,190224.11,137561.69,240732.95,181234.41,317160.21999999997,224498.17,392871.8,252886.27,442550.97,280910.83,491593.96]
[7,2022,"Region VII - Midwest","MISSOURI","MO","COLUMBIA",4,"Elevator",86396.29,138234.07,120954.81,193527.7,155513.32999999999,248821.33,207351.1,331761.77,259188.88,414702.21,293747.39,469995.84,328305.90999999997,525289.47]
[7,2022,"Region VII - Midwest","MISSOURI","MO","JEFFERSON CITY",1,"Detached/Semi-Detached",107388.06,187929.1,139280.14000000001,243740.25,166425.04,291243.82,198331.34,347079.84,233407.93,408463.88,255916.22,447853.38,277672.84000000003,485927.46]
[7,2022,"Region VII - Midwest","MISSOURI","MO","JEFFERSON CITY",2,"Row House",84448.82,147785.43,110578.4,193512.2,133911.20000000001,234344.6,163753.41,286568.46999999997,194210.05,339867.59,213982.88,374470.05,232454.21,406794.86]
[7,2022,"Region VII - Midwest","MISSOURI","MO","JEFFERSON CITY",3,"Walkup",80763.789999999994,141336.63,110146.64,192756.62,139486.85999999999,244102.01,183865.47,321764.57,227847.13,398732.48,256727.2,449272.6,285254.43,499195.25]
[7,2022,"Region VII - Midwest","MISSOURI","MO","JEFFERSON CITY",4,"Elevator",86577.38,138523.81,121208.33,193933.33,155839.28,249342.85,207785.71,332457.13,259732.13,415571.42,294363.08,470980.94,328994.03000000003,526390.46]
[7,2022,"Region VII - Midwest","MISSOURI","MO","JOPLIN",1,"Detached/Semi-Detached",100886.61,176551.57,130701.14,228726.99,156050.04,273087.57,185789.29,325131.26,218534.96,382436.18,239544.06,419202.1,259790.69,454633.7]
[7,2022,"Region VII - Midwest","MISSOURI","MO","JOPLIN",2,"Row House",80264.47,140462.82,104898.56,183572.49,126820.43,221935.75,154704.07999999999,270732.15000000002,183296.47,320768.82,201846.41,353231.22,219139.6,383494.29]
[7,2022,"Region VII - Midwest","MISSOURI","MO","JOPLIN",3,"Walkup",77468.7,135570.23000000001,105828.74,185200.3,134150.45000000001,234763.29,176964.1,309687.17,219420.89,383986.56,247328.93,432825.62,274919.77,481109.59]
[7,2022,"Region VII - Midwest","MISSOURI","MO","JOPLIN",4,"Elevator",81822.64,130916.23,114551.7,183282.73,147280.76,235649.22,196374.35,314198.96000000002,245467.93,392748.7,278196.99,445115.19,310926.05,497481.69]
[7,2022,"Region VII - Midwest","MISSOURI","MO","KANSAS CITY",1,"Detached/Semi-Detached",116275.64,203482.38,150726.81,263771.92,180034.72,315060.76,214452.76,375292.33,252318.83,441557.95,276615.2,484076.61,300066.87,525117.03]
[7,2022,"Region VII - Midwest","MISSOURI","MO","KANSAS CITY",2,"Row House",91946.15,160905.76,120285.58,210499.76,145550.35,254713.11,177779.20000000001,311113.59999999998,210745.33,368804.32,232140.46,406245.8,252107.72,441188.52]
[7,2022,"Region VII - Midwest","MISSOURI","MO","KANSAS CITY",3,"Walkup",88320.85,154561.48000000001,120549.4,210961.45,152732.73000000001,267282.28000000003,201398.32,352447.06,249642.91,436875.09,281338.2,492341.85,312659.26,547153.71]
[7,2022,"Region VII - Midwest","MISSOURI","MO","KANSAS CITY",4,"Elevator",94009.15,150414.65,131612.81,210580.51,169216.48,270746.37,225621.97,360995.15,282027.46000000002,451243.94,319631.12,511409.8,357234.78,571575.66]
[7,2022,"Region VII - Midwest","MISSOURI","MO","ROLLA",1,"Detached/Semi-Detached",101350.53,177363.42,131250.53,229688.42,156662.32,274159.06,186455.52,326297.15999999997,219278.84,383737.96,240336.53,420588.92,260608.44,456064.76]
[7,2022,"Region VII - Midwest","MISSOURI","MO","ROLLA",2,"Row House",80960.09,141680.16,105737.87,185041.27,127761.13,223581.98,155719.59,272509.27,184436.28,322763.49,203062.45,355359.29,220414.1,385724.68]
[7,2022,"Region VII - Midwest","MISSOURI","MO","ROLLA",3,"Walkup",78385.8,137175.14000000001,107142.19,187498.84,135860.70000000001,237756.22,179265.8,313715.15999999997,222318.07999999999,389056.63,250627.55,438598.21,278623.39,487590.93]
[7,2022,"Region VII - Midwest","MISSOURI","MO","ROLLA",4,"Elevator",82370.13,131792.21,115318.18,184509.09,148266.23000000001,237225.98,197688.31,316301.3,247110.39,395376.63,280058.44,448093.51,313006.49,500810.39]
[7,2022,"Region VII - Midwest","MISSOURI","MO","SPRINGFIELD",1,"Detached/Semi-Detached",105266.04,184215.58,136599.59,239049.29,163282.62,285744.58,194673.38,340678.41,229158.08,401026.64,251288.25,439754.44,272709.09999999998,477240.93]
[7,2022,"Region VII - Midwest","MISSOURI","MO","SPRINGFIELD",2,"Row House",82326.8,144071.9,107897.86,188821.25,130768.78,228845.36,160095.45000000001,280167.03999999998,189960.21,332430.36,209354.92,366371.11,227490.47,398108.33]
[7,2022,"Region VII - Midwest","MISSOURI","MO","SPRINGFIELD",3,"Walkup",78389.31,137181.29,106822.38,186939.16,135212.81,236622.41,178166.73,311791.77,220723.71,386266.48,248653.98,435144.46,276231.42,483404.98]
[7,2022,"Region VII - Midwest","MISSOURI","MO","SPRINGFIELD",4,"Elevator",84628.89,135406.23000000001,118480.45,189568.72,152332,243731.21,203109.34,324974.94,253886.67,406218.68,287738.23,460381.17,321589.78000000003,514543.66]
[7,2022,"Region VII - Midwest","MISSOURI","MO","ST. JOSEPH",1,"Detached/Semi-Detached",112428.94,196750.65,145794.35999999999,255140.13,174188.82,304830.43,207554.8,363220.9,244244.42,427427.74,267787.21999999997,468627.64,290533.96999999997,508434.45]
[7,2022,"Region VII - Midwest","MISSOURI","MO","ST. JOSEPH",2,"Row House",88562.86,154985.01,115932.96,202882.67,140361.29,245632.25,171579.79,300264.62,203462.8,356059.9,224159.61,392279.32,243488.33,426104.57]
[7,2022,"Region VII - Midwest","MISSOURI","MO","ST. JOSEPH",3,"Walkup",84812.46,148421.81,115696.7,202469.22,146536.57999999999,256439.02,193179.56,338064.23,239409.55,418966.72,269770.69,472098.7,299764.73,524588.27]
[7,2022,"Region VII - Midwest","MISSOURI","MO","ST. JOSEPH",4,"Elevator",90720.02,145152.04,127008.03,203212.86,163296.04,261273.67,217728.06,348364.9,272160.07,435456.12,308448.08,493516.94,344736.09,551577.76]
[7,2022,"Region VII - Midwest","MISSOURI","MO","ST. LOUIS",1,"Detached/Semi-Detached",118664.02,207662.04,153890.37,269308.14,183870.48,321773.34000000003,219103.79,383431.63,257843.04,451225.32,282701.28000000003,494727.24,306723.37,536765.9]
[7,2022,"Region VII - Midwest","MISSOURI","MO","ST. LOUIS",2,"Row House",93407.69,163463.45000000001,122289.46,214006.55,148072.42000000001,259126.73,181033.14,316807.99,214685.78,375700.12,236532.26,413931.45,256937.2,449640.1]
[7,2022,"Region VII - Midwest","MISSOURI","MO","ST. LOUIS",3,"Walkup",89401.43,156452.51,121944.13,213402.23,154439.89000000001,270269.81,203589,356280.74,252301.07,441526.87,284290.19,497507.82,315890.83,552808.94999999995]
[7,2022,"Region VII - Midwest","MISSOURI","MO","ST. LOUIS",4,"Elevator",95716.2,153145.92000000001,134002.68,214404.29,172289.16,275662.65999999997,229718.88,367550.21,287148.59999999998,459437.77,325435.08,520696.13,363721.56,581954.5]
[7,2022,"Region VII - Midwest","NEBRASKA","NE","GRAND ISLAND",1,"Detached/Semi-Detached",102811.08,179919.38,133315.29999999999,233301.77,159273.53,278728.67,189774.09,332104.65999999997,223315.29,390801.76,244837.66,428465.91,265629.43,464851.5]
[7,2022,"Region VII - Midwest","NEBRASKA","NE","GRAND ISLAND",2,"Row House",81030.38,141803.17000000001,106063.14,185610.5,128401.8,224703.15,156942.51999999999,274649.40999999997,186097.11,325669.94,205022.17,358788.8,222694.57,389715.49]
[7,2022,"Region VII - Midwest","NEBRASKA","NE","GRAND ISLAND",3,"Walkup",77632.2,135856.34,105910.03,185342.55,134147.37,234757.9,176853.07,309492.87,219181.87,383568.28,246982.3,432219.03,274447.71999999997,480283.51]
[7,2022,"Region VII - Midwest","NEBRASKA","NE","GRAND ISLAND",4,"Elevator",82982.210000000006,132771.53,116175.09,185880.15,149367.97,238988.76,199157.3,318651.68,248946.62,398314.6,282139.5,451423.21,315332.39,504531.83]
[7,2022,"Region VII - Midwest","NEBRASKA","NE","LINCOLN",1,"Detached/Semi-Detached",102147.39,178757.94,132403.66,231706.41,158141.26,276747.2,188363.07,329635.38,221615.65,387827.39,242951.62,425165.34,263542.12,461198.71]
[7,2022,"Region VII - Midwest","NEBRASKA","NE","LINCOLN",2,"Row House",80830.12,141452.71,105731.34,185029.84,127926.38,223871.16,156230.04999999999,273402.58,185189.34,324081.34999999998,203983.27,356970.72,221520.77,387661.34]
[7,2022,"Region VII - Midwest","NEBRASKA","NE","LINCOLN",3,"Walkup",77685.52,135949.66,106043.73,185576.52,134362.31,235134.04,177182.42,310069.23,219633.65,384358.89,247524.62,433168.08,275087.69,481403.46]
[7,2022,"Region VII - Midwest","NEBRASKA","NE","LINCOLN",4,"Elevator",82615.81,132185.29,115662.13,185059.41,148708.45000000001,237933.53,198277.94,317244.7,247847.42,396555.88,280893.74,449430,313940.07,502304.12]
[7,2022,"Region VII - Midwest","NEBRASKA","NE","NORFOLK",1,"Detached/Semi-Detached",103010.85,180268.99,133677.54999999999,233935.72,159793.53,279638.68,190518.89,333408.06,224271.06,392474.36,245931.25,430379.68,266899,467073.25]
[7,2022,"Region VII - Midwest","NEBRASKA","NE","NORFOLK",2,"Row House",80535.03,140936.29999999999,105555.65,184722.38,127936.54,223888.94,156639.51,274119.14,185865.06,325263.86,204845.05,358478.84,222593.88,389539.29]
[7,2022,"Region VII - Midwest","NEBRASKA","NE","NORFOLK",3,"Walkup",76661.78,134158.12,104462.88,182810.04,132222.20000000001,231388.86,174222.02,304888.53999999998,215832.92,377707.61,243141.39,425497.43,270104.14,472682.25]
[7,2022,"Region VII - Midwest","NEBRASKA","NE","NORFOLK",4,"Elevator",82801.13,132481.81,115921.58,185474.53,149042.03,238467.25,198722.71,317956.33,248403.38,397445.42,281523.83,450438.14,314644.28000000003,503430.86]
[7,2022,"Region VII - Midwest","NEBRASKA","NE","NORTH PLATTE",1,"Detached/Semi-Detached",101816.66,178179.16,132095.78,231167.61,157875.65,276282.39,188193.38,329338.40999999997,221508.96,387640.68,242888.21,425054.36,263570.75,461248.82]
[7,2022,"Region VII - Midwest","NEBRASKA","NE","NORTH PLATTE",2,"Row House",79804.259999999995,139657.45000000001,104553.7,182968.98,126675.5,221682.13,155012.54,271271.94,183894.84,321815.96000000002,202649.15,354636.01,220179.14,385313.49]
[7,2022,"Region VII - Midwest","NEBRASKA","NE","NORTH PLATTE",3,"Walkup",76121.490000000005,133212.6,103765.51,181589.65,131368.62,229895.09,173126.69,302971.7,214503.84,375381.73,241665.39,422914.44,268488.36,469854.63]
[7,2022,"Region VII - Midwest","NEBRASKA","NE","NORTH PLATTE",4,"Elevator",81947.600000000006,131116.17000000001,114726.65,183562.64,147505.69,236009.1,196674.25,314678.81,245842.81,393348.51,278621.84999999998,445794.97,311400.90000000002,498241.44]
[7,2022,"Region VII - Midwest","NEBRASKA","NE","OMAHA",1,"Detached/Semi-Detached",104469.17,182821.06,135446.45000000001,237031.3,161803.67000000001,283156.43,192765.82,337340.19,226821.26,396937.2,248673.15,435178.02,269775.40999999997,472106.97]
[7,2022,"Region VII - Midwest","NEBRASKA","NE","OMAHA",2,"Row House",82456.77,144299.35,107904.38,188832.67,130603.53,228556.17,159584.98000000001,279273.71999999997,189207.14,331112.49,208434.1,364759.67,226383.8,396171.64]
[7,2022,"Region VII - Midwest","NEBRASKA","NE","OMAHA",3,"Walkup",79089.58,138406.76,107920.84,188861.47,136711.19,239244.58,180250.1,315437.68,223408.12,390964.21,251756.9,440574.58,279767.11,489592.43]
[7,2022,"Region VII - Midwest","NEBRASKA","NE","OMAHA",4,"Elevator",84383.21,135013.14000000001,118136.49,189018.39,151889.78,243023.65,202519.7,324031.53000000003,253149.63,405039.41,286902.90999999997,459044.67,320656.2,513049.92]
[8,2022,"Region VIII -","COLORADO","CO","BOULDER",1,"Detached/Semi-Detached",106127.28,185722.73,137577.62,240760.83,164333.82999999999,287584.2,195757.56,342575.73,230327.23,403072.66,252508.65,441890.14,273921.40000000002,479362.45]
[8,2022,"Region VIII -","COLORADO","CO","BOULDER",2,"Row House",83883.16,146795.54,109745.63,192054.85,132805.26,232409.2,162227.45000000001,283898.03000000003,192317.18,336555.06,211846.03,370730.55,230073.03,402627.81]
[8,2022,"Region VIII -","COLORADO","CO","BOULDER",3,"Walkup",80546.960000000006,140957.19,109931.66,192380.4,139275.01,243731.26,183647.15,321382.51,227634.37,398360.15,256531.51,448930.15,285086.51,498901.39]
[8,2022,"Region VIII -","COLORADO","CO","BOULDER",4,"Elevator",85784.21,137254.75,120097.9,192156.64,154411.59,247058.54,205882.12,329411.39,257352.64,411764.24,291666.33,466666.14,325980.02,521568.03]
[8,2022,"Region VIII -","COLORADO","CO","COLORADO SPRINGS",1,"Detached/Semi-Detached",102413.75999999999,179224.07,132886.66,232551.66,158834.59,277960.53000000003,189356.13,331373.23,222890.01,390057.51,244409.72,427717.01,265234.87,464161.03]
[8,2022,"Region VIII -","COLORADO","CO","COLORADO SPRINGS",2,"Row House",80169.64,140296.88,105054.67,183845.68,127306.02,222785.53,155826.01999999999,272695.53000000003,184879.95,323539.90999999997,203747.1,356557.42,221386.51,387426.38]
[8,2022,"Region VIII -","COLORADO","CO","COLORADO SPRINGS",3,"Walkup",76391.63,133685.35999999999,104114.19,182199.84,131795.41,230641.97,173674.35,303930.12,215168.38,376544.67,242403.39,424205.93,269296.25,471268.44]
[8,2022,"Region VIII -","COLORADO","CO","COLORADO SPRINGS",4,"Elevator",82374.36,131798.99,115324.11,184518.58,148273.85999999999,237238.17,197698.48,316317.56,247123.09,395396.96,280072.84000000003,448116.55,313022.59000000003,500836.14]
[8,2022,"Region VIII -","COLORADO","CO","DENVER",1,"Detached/Semi-Detached",106790.96,186884.19,138489.26,242356.2,165466.1,289565.68,197168.59,345045.02,232026.88,406047.04,254394.7,445190.73,276008.71999999997,483015.25]
[8,2022,"Region VIII -","COLORADO","CO","DENVER",2,"Row House",84083.43,147146.01,110077.43,192635.51,133280.69,233241.2,162939.93,285144.88,193224.94,338143.65,212884.94,372548.64,231246.84,404681.97]
[8,2022,"Region VIII -","COLORADO","CO","DENVER",3,"Walkup",80493.64,140863.87,109797.96,192146.43,139060.07999999999,243355.13,183317.8,320806.15000000002,227182.6,397569.55,255989.2,447981.11,284446.53999999998,497781.44]
[8,2022,"Region VIII -","COLORADO","CO","DENVER",4,"Elevator",86150.62,137840.99,120610.86,192977.39,155071.10999999999,248113.78,206761.48,330818.37,258451.85,413522.97,292912.09999999998,468659.36,327372.34999999998,523795.76]
[8,2022,"Region VIII -","COLORADO","CO","DURANGO",1,"Detached/Semi-Detached",100820.02,176435.04,130580.39,228515.68,155876.71,272784.25,185541.03,324696.81,218216.38,381878.66,239179.54,418564.19,259367.51,453893.13]
[8,2022,"Region VIII -","COLORADO","CO","DURANGO",2,"Row House",80429.59,140751.78,105067.73,183868.53,126975.52,222207.17,154805.1,270908.92,183373.82,320904.19,201905.46,353334.56,219173.17,383553.05]
[8,2022,"Region VIII -","COLORADO","CO","DURANGO",3,"Walkup",77792.179999999993,136136.31,106311.13,186044.48,134792.18,235886.32,177841.12,311221.96000000002,220537.22,385940.14,248609.25,435066.18,276367.64,483643.37]
[8,2022,"Region VIII -","COLORADO","CO","DURANGO",4,"Elevator",81883.009999999995,131012.82,114636.21,183417.94,147389.41,235823.07,196519.22,314430.76,245649.02,393038.45,278402.23,445443.57,311155.43,497848.7]
[8,2022,"Region VIII -","COLORADO","CO","FORT COLLINS",1,"Detached/Semi-Detached",106327.05,186072.34,137939.87,241394.76,164853.82999999999,288494.2,196502.36,343879.12,231283,404745.25,253602.23,443803.91,275190.96999999997,481584.19]
[8,2022,"Region VIII -","COLORADO","CO","FORT COLLINS",2,"Row House",83387.81,145928.66,109238.13,191166.72,132339.99,231594.98,161924.43,283367.75,192085.13,336148.97,211668.9,370420.57,229972.34,402451.59]
[8,2022,"Region VIII -","COLORADO","CO","FORT COLLINS",3,"Walkup",79576.55,139258.96,108484.51,189847.89,137349.82999999999,240362.21,181016.09,316778.15999999997,224285.41,392499.48,252690.58,442208.52,280742.92,491300.1]
[8,2022,"Region VIII -","COLORADO","CO","FORT COLLINS",4,"Elevator",85603.13,136965.01,119844.39,191751.02,154085.64000000001,246537.03,205447.52,328716.03000000003,256809.4,410895.04,291050.65000000002,465681.05,325291.90000000002,520467.05]
[8,2022,"Region VIII -","COLORADO","CO","GRAND JUNCTION",1,"Detached/Semi-Detached",107785.38,188624.41,139708.78,244490.36,166863.98000000001,292011.96000000002,198749.3,347811.27,233833.21,409208.12,256344.16,448602.27,278067.39,486617.94]
[8,2022,"Region VIII -","COLORADO","CO","GRAND JUNCTION",2,"Row House",85309.56,149291.72,111586.87,195277.02,135006.99,236262.22,164869.91,288522.34999999998,195427.21,341997.62,215257.96,376701.43,233762.27,409083.97]
[8,2022,"Region VIII -","COLORADO","CO","GRAND JUNCTION",3,"Walkup",82004.350000000006,143507.60999999999,111942.47,195899.33,141838.82,248217.94,187044.19,327327.32,231860.62,405756.09,261306.11,457285.7,290405.90000000002,508210.32]
[8,2022,"Region VIII -","COLORADO","CO","GRAND JUNCTION",4,"Elevator",87185.22,139496.35,122059.31,195294.9,156933.4,251093.44,209244.53,334791.25,261555.66,418489.06,296429.75,474287.6,331303.84000000003,530086.14]
[8,2022,"Region VIII -","COLORADO","CO","GREELEY",1,"Detached/Semi-Detached",105266.04,184215.58,136599.59,239049.29,163282.62,285744.58,194673.38,340678.41,229158.08,401026.64,251288.25,439754.44,272709.09999999998,477240.93]
[8,2022,"Region VIII -","COLORADO","CO","GREELEY",2,"Row House",82326.8,144071.9,107897.86,188821.25,130768.78,228845.36,160095.45000000001,280167.03999999998,189960.21,332430.36,209354.92,366371.11,227490.47,398108.33]
[8,2022,"Region VIII -","COLORADO","CO","GREELEY",3,"Walkup",78389.31,137181.29,106822.38,186939.16,135212.81,236622.41,178166.73,311791.77,220723.71,386266.48,248653.98,435144.46,276231.42,483404.98]
[8,2022,"Region VIII -","COLORADO","CO","GREELEY",4,"Elevator",84628.89,135406.23000000001,118480.45,189568.72,152332,243731.21,203109.34,324974.94,253886.67,406218.68,287738.23,460381.17,321589.78000000003,514543.66]
[8,2022,"Region VIII -","COLORADO","CO","MONTROSE",1,"Detached/Semi-Detached",96509.41,168891.46,125098.55,218922.46,149418.53,261482.43,177976.84,311459.48,209398.09,366446.66,229559.08,401728.4,249016.85,435779.49]
[8,2022,"Region VIII -","COLORADO","CO","MONTROSE",2,"Row House",76350.679999999993,133613.69,99875.81,174782.66,120845.77,211480.09,147590.18,258282.81,174951.48,306165.08,192708.58,337240.01,209279.27,366238.71999999997]
[8,2022,"Region VIII -","COLORADO","CO","MONTROSE",3,"Walkup",73366.7,128391.72,100144.98,175253.71,126885.79,222050.14,167320.65,292811.14,207406.68,362961.69,233743.12,409050.45,259769.48,454596.6]
[8,2022,"Region VIII -","COLORADO","CO","MONTROSE",4,"Elevator",78046.39,124874.23,109264.95,174823.93,140483.51,224773.62,187311.35,299698.15999999997,234139.18,374622.7,265357.74,424572.39,296576.3,474522.09]
[8,2022,"Region VIII -","COLORADO","CO","PUEBLO",1,"Detached/Semi-Detached",102213.98,178874.47,132524.41,231917.72,158314.59,277050.53000000003,188611.34,330069.84000000003,221934.24,388384.92,243316.15,425803.25,263965.31,461939.29]
[8,2022,"Region VIII -","COLORADO","CO","PUEBLO",2,"Row House",80665,141163.75,105562.17,184733.8,127771.29,223599.75,156129.04,273225.82,185112,323945.99,203924.23,356867.39,221487.2,387602.6]
[8,2022,"Region VIII -","COLORADO","CO","PUEBLO",3,"Walkup",77362.05,135383.59,105561.34,184732.35,133720.59,234011.02,176305.4,308534.45,218517.33,382405.34,246244.31,430927.54,273639.83,478869.7]
[8,2022,"Region VIII -","COLORADO","CO","PUEBLO",4,"Elevator",82555.45,132088.72,115577.63,184924.2,148599.79999999999,237759.69,198133.07,317012.92,247666.34,396266.15,280688.52,449101.64,313710.7,501937.12]
[8,2022,"Region VIII -","MONTANA","MT","BILLINGS",1,"Detached/Semi-Detached",105530.18,184677.82,136786.73000000001,239376.78,163374.89000000001,285906.05,194594.81,340540.91,228946.19,400655.83,250987.14,439227.49,272257.28000000003,476450.24]
[8,2022,"Region VIII -","MONTANA","MT","BILLINGS",2,"Row House",83517.78,146156.12,109244.66,191178.15,132174.74,231305.8,161413.97,282474.44,191332.06,334831.11,210748.08,368809.14,228865.67,400514.92]
[8,2022,"Region VIII -","MONTANA","MT","BILLINGS",3,"Walkup",80276.820000000007,140484.43,109582.98,191770.21,138848.22,242984.38,183099.48,320424.09000000003,226969.84,397197.21,255793.52,447638.65,284278.62,497487.58]
[8,2022,"Region VIII -","MONTANA","MT","BILLINGS",4,"Elevator",85357.45,136571.93,119500.44,191200.7,153643.42000000001,245829.47,204857.89,327772.63,256072.36,409715.79,290215.34999999998,464344.56,324358.33,518973.33]
[8,2022,"Region VIII -","MONTANA","MT","BUTTE",1,"Detached/Semi-Detached",101286.16,177250.77,131425.64000000001,229994.86,157090.04,274907.57,187278.88,327738.03999999998,220446.49,385781.36,241731.21,423029.62,262329.81,459077.17]
[8,2022,"Region VIII -","MONTANA","MT","BUTTE",2,"Row House",79273.75,138729.07,103883.56,181796.24,125889.89,220307.31,154098.04,269671.57,182832.37,319956.65000000002,201492.15,352611.27,218938.2,383141.85]
[8,2022,"Region VIII -","MONTANA","MT","BUTTE",3,"Walkup",75527.87,132173.76999999999,102934.44,180135.27,130300.11,228025.18,171701.99,300478.49,212722.98,372265.21,239647.08,419382.39,266232.59999999998,465907.05]
[8,2022,"Region VIII -","MONTANA","MT","BUTTE",4,"Elevator",81460.479999999996,130336.77,114044.67,182471.48,146628.85999999999,234606.19,195505.15,312808.25,244381.44,391010.31,276965.63,443145.02,309549.83,495279.73]
[8,2022,"Region VIII -","MONTANA","MT","GREAT FALLS",1,"Detached/Semi-Detached",104933.09,183632.91,135995.84,237992.73,162415.95000000001,284227.90999999997,193432.05,338506.09,227565.14,398238.99,249465.62,436564.84,270593.15999999997,473538.03]
[8,2022,"Region VIII -","MONTANA","MT","GREAT FALLS",2,"Row House",83152.399999999994,145516.69,108743.69,190301.45,131544.23000000001,230202.39,160600.48000000001,281050.84999999998,190346.95,333107.17,209650.14,366887.74,227658.3,398402.03]
[8,2022,"Region VIII -","MONTANA","MT","GREAT FALLS",3,"Walkup",80006.67,140011.68,109234.29,191160.01,138421.43,242237.5,182551.81,319465.67,226305.3,396034.28,255055.52,446347.16,283470.73,496073.77]
[8,2022,"Region VIII -","MONTANA","MT","GREAT FALLS",4,"Elevator",84930.69,135889.10999999999,118902.97,190244.76,152875.25,244600.4,203833.67,326133.87,254792.08,407667.34,288764.36,462022.98,322736.64000000001,516378.63]
[8,2022,"Region VIII -","MONTANA","MT","HELENA",1,"Detached/Semi-Detached",103872.08,181776.14,134655.57,235647.25,160844.74,281478.28999999998,191603.07,335305.37,225440.21,394520.37,247151.64,432515.37,268111.28999999998,469194.76]
[8,2022,"Region VIII -","MONTANA","MT","HELENA",2,"Row House",82091.39,143659.93,107403.41,187955.97,129973.01,227452.77,158771.5,277850.13,188222.03,329388.55,207336.15,362838.26,225176.43,394058.75]
[8,2022,"Region VIII -","MONTANA","MT","HELENA",3,"Walkup",78819.429999999993,137934.01,107572.16,188251.27,136284.4,238497.7,179702.44,314479.26,222743.58,389801.27,251018.91,439283.09,278959.21999999997,488178.63]
[8,2022,"Region VIII -","MONTANA","MT","HELENA",4,"Elevator",83956.45,134330.32,117539.03,188062.45,151121.60999999999,241794.58,201495.48,322392.77,251869.35,402990.96,285451.93,456723.09,319034.51,510455.22]
[8,2022,"Region VIII -","MONTANA","MT","MISSOULA",1,"Detached/Semi-Detached",102413.75999999999,179224.07,132886.66,232551.66,158834.59,277960.53000000003,189356.13,331373.23,222890.01,390057.51,244409.72,427717.01,265234.87,464161.03]
[8,2022,"Region VIII -","MONTANA","MT","MISSOULA",2,"Row House",80169.64,140296.88,105054.67,183845.68,127306.02,222785.53,155826.01999999999,272695.53000000003,184879.95,323539.90999999997,203747.1,356557.42,221386.51,387426.38]
[8,2022,"Region VIII -","MONTANA","MT","MISSOULA",3,"Walkup",76391.63,133685.35999999999,104114.19,182199.84,131795.41,230641.97,173674.35,303930.12,215168.38,376544.67,242403.39,424205.93,269296.25,471268.44]
[8,2022,"Region VIII -","MONTANA","MT","MISSOULA",4,"Elevator",82374.36,131798.99,115324.11,184518.58,148273.85999999999,237238.17,197698.48,316317.56,247123.09,395396.96,280072.84000000003,448116.55,313022.59000000003,500836.14]
[8,2022,"Region VIII -","NORTH DAKOTA","ND","BISMARCK",1,"Detached/Semi-Detached",108648.83,190135.45,140982.66,246719.65,168516.24,294903.43,200905.11,351583.94,236488.61,413855.06,259323.77,453816.59,281424.25,492492.44]
[8,2022,"Region VIII -","NORTH DAKOTA","ND","BISMARCK",2,"Row House",85014.46,148775.31,111411.17,194969.55,135017.14000000001,236279.99,165279.35999999999,289238.89,196102.92,343180.11,216119.73,378209.52,234835.36,410961.89]
[8,2022,"Region VIII -","NORTH DAKOTA","ND","BISMARCK",3,"Walkup",80980.600000000006,141716.04999999999,110361.62,193132.83,139698.71,244472.74,184083.78,322146.61,228059.88,399104.79,256922.87,449615.02,285422.33,499489.08]
[8,2022,"Region VIII -","NORTH DAKOTA","ND","BISMARCK",4,"Elevator",87370.53,139792.85999999999,122318.75,195710,157266.96,251627.14,209689.28,335502.86,262111.6,419378.57,297059.82,475295.72,332008.03000000003,531212.86]
[8,2022,"Region VIII -","NORTH DAKOTA","ND","FARGO",1,"Detached/Semi-Detached",105199.45,184099.04,136478.84,238837.98,163109.28,285441.25,194425.11,340243.95,228839.49,400469.11,250923.73,439116.52,272285.90999999997,476500.35]
[8,2022,"Region VIII -","NORTH DAKOTA","ND","FARGO",2,"Row House",82491.92,144360.85999999999,108067.02,189117.29,130923.87,229116.77,160196.46,280343.8,190037.56,332565.71999999997,209413.96,366474.43,227524.04,398167.07]
[8,2022,"Region VIII -","NORTH DAKOTA","ND","FARGO",3,"Walkup",78712.78,137747.37,107304.76,187783.33,135854.53,237745.43,179043.74,313326.55,221840.02,388220.04,249934.29,437385,277679.28000000003,485938.74]
[8,2022,"Region VIII -","NORTH DAKOTA","ND","FARGO",4,"Elevator",84689.25,135502.79999999999,118564.95,189703.93,152440.65,243905.05,203254.2,325206.73,254067.75,406508.41,287943.45,460709.53,321819.15000000002,514910.65]
[8,2022,"Region VIII -","NORTH DAKOTA","ND","GRAND FORKS",1,"Detached/Semi-Detached",106990.73,187233.78,138851.5,242990.13,165986.1,290475.67,197913.37,346348.41,232982.64,407719.62,255488.27,447104.48,277278.27,485236.98]
[8,2022,"Region VIII -","NORTH DAKOTA","ND","GRAND FORKS",2,"Row House",83588.070000000007,146279.13,109569.93,191747.38,132815.41,232426.98,162636.9,284614.58,192992.89,337737.56,212707.8,372238.65,231146.14,404505.74]
[8,2022,"Region VIII -","NORTH DAKOTA","ND","GRAND FORKS",3,"Walkup",79523.22,139165.64000000001,108350.81,189613.91,137134.9,239986.07,180686.74,316201.8,223833.63,391708.86,252148.27,441259.47,280102.94,490180.15]
[8,2022,"Region VIII -","NORTH DAKOTA","ND","GRAND FORKS",4,"Elevator",85969.53,137551.25,120357.35,192571.76,154745.16,247592.26,206326.88,330123.01,257908.6,412653.76,292296.40999999997,467674.26,326684.21999999997,522694.76]
[8,2022,"Region VIII -","NORTH DAKOTA","ND","JAMESTOWN",1,"Detached/Semi-Detached",106526.82,186421.94,138302.12,242028.7,165373.82999999999,289404.19,197247.15,345182.51,232238.77,406417.84,254695.81,445717.67,276460.53000000003,483805.92]
[8,2022,"Region VIII -","NORTH DAKOTA","ND","JAMESTOWN",2,"Row House",82892.45,145061.79,108730.63,190278.6,131874.72,230780.76,161621.41,282837.46000000002,191853.08,335742.89,211491.77,370110.6,229871.64,402275.37]
[8,2022,"Region VIII -","NORTH DAKOTA","ND","JAMESTOWN",3,"Walkup",78606.13,137560.73000000001,107037.36,187315.38,135424.66,236993.15,178385.05,312173.83,220936.46,386638.81,248849.66,435486.91,276399.34000000003,483698.84]
[8,2022,"Region VIII -","NORTH DAKOTA","ND","JAMESTOWN",4,"Elevator",85422.05,136675.28,119590.87,191345.4,153759.69,246015.51,205012.92,328020.68,256266.15,410025.85,290434.96999999997,464695.96,324603.78999999998,519366.07]
[8,2022,"Region VIII -","NORTH DAKOTA","ND","MINOT",1,"Detached/Semi-Detached",103674.53,181430.43,134589.18,235531.07,160925.79999999999,281620.15000000002,191929.9,335877.33,225970.69,395448.72,247817.28,433680.24,268986.3,470726.03]
[8,2022,"Region VIII -","NORTH DAKOTA","ND","MINOT",2,"Row House",80735.289999999994,141286.76,105887.44,185303.03,128411.96,224720.93,157351.98000000001,275365.96000000002,186772.82,326852.43,205883.95,360296.9,223767.67,391593.42]
[8,2022,"Region VIII -","NORTH DAKOTA","ND","MINOT",3,"Walkup",76608.45,134064.79,104329.17,182576.05,132007.26,231012.71,173892.67,304312.17,215381.13,376916.98,242599.06,424548.36,269464.15999999997,471562.28]
[8,2022,"Region VIII -","NORTH DAKOTA","ND","MINOT",4,"Elevator",83167.520000000004,133068.04,116434.53,186295.26,149701.54,239522.47,199602.06,319363.3,249502.57,399204.12,282769.58,452431.34,316036.59000000003,505658.56]
[8,2022,"Region VIII -","NORTH DAKOTA","ND","WILLISTON",1,"Detached/Semi-Detached",106393.64,186188.87,138060.62,241606.08,165027.16,288797.53000000003,196750.62,344313.59,231601.59,405302.78,253966.76,444441.83,275614.15000000002,482324.77]
[8,2022,"Region VIII -","NORTH DAKOTA","ND","WILLISTON",2,"Row House",83222.69,145639.71,109068.96,190870.68,132184.9,231323.57,161823.42000000001,283190.99,192007.78,336013.61,211609.85,370317.25,229938.77,402392.85]
[8,2022,"Region VIII -","NORTH DAKOTA","ND","WILLISTON",3,"Walkup",79253.070000000007,138692.88,108002.12,189003.72,136708.10999999999,239239.19,180139.08,315243.39,223169.1,390545.91999999998,251410.28,439967.98,279295.06,488766.35]
[8,2022,"Region VIII -","NORTH DAKOTA","ND","WILLISTON",4,"Elevator",85542.77,136868.44,119759.88,191615.81,153976.99,246363.19,205302.65,328484.25,256628.32,410605.31,290845.42,465352.69,325062.53000000003,520100.06]
[8,2022,"Region VIII -","SOUTH DAKOTA","SD","ABERDEEN",1,"Detached/Semi-Detached",104602.36,183054.13,135687.96,237453.93,162150.35,283763.11,193262.36,338209.13,227458.44,398052.28,249402.21,436453.87,270621.8,473588.14]
[8,2022,"Region VIII -","SOUTH DAKOTA","SD","ABERDEEN",2,"Row House",82126.539999999994,143721.44,107566.05,188240.59,130293.35,228013.37,159382.97,278920.2,189052.44,330841.78000000003,208316.02,364553.03,226316.67,396054.18]
[8,2022,"Region VIII -","SOUTH DAKOTA","SD","ABERDEEN",3,"Walkup",78442.64,137274.60999999999,106956.08,187173.13,135427.74,236998.55,178496.08,312368.13,221175.49,387057.1,249196.29,436093.51,276871.39,484524.93]
[8,2022,"Region VIII -","SOUTH DAKOTA","SD","ABERDEEN",4,"Elevator",84262.49,134819.99,117967.49,188747.98,151672.48000000001,242675.98,202229.98,323567.96999999997,252787.47,404459.96,286492.46999999997,458387.96,320197.46000000002,512315.95]
[8,2022,"Region VIII -","SOUTH DAKOTA","SD","MITCHELL",1,"Detached/Semi-Detached",99097.56,173420.72,128624.34,225092.6,153774.29,269105.01,183372.66,320902.15999999997,215878.06,377786.61,236738.73,414292.78,256942.9,449650.07]
[8,2022,"Region VIII -","SOUTH DAKOTA","SD","MITCHELL",2,"Row House",77316.86,135304.51,101372.19,177401.33,122902.56,215079.49,150541.09,263446.90999999997,178659.88,312654.78999999998,196923.24,344615.67,214008.04,374514.07]
[8,2022,"Region VIII -","SOUTH DAKOTA","SD","MITCHELL",3,"Walkup",73476.87,128584.51,100092.56,175161.98,126667.78,221668.61,166880.28,292040.48,206715.88,361752.79,232854.18,407494.81,258657.46,452650.56]
[8,2022,"Region VIII -","SOUTH DAKOTA","SD","MITCHELL",4,"Elevator",79572.36,127315.77,111401.3,178242.08,143230.24,229168.39,190973.66,305557.84999999998,238717.07,381947.32,270546.01,432873.63,302374.96000000002,483799.94]
[8,2022,"Region VIII -","SOUTH DAKOTA","SD","PIERRE",1,"Detached/Semi-Detached",104866.5,183516.37,135875.09,237781.41,162242.62,283924.58,193183.79,338071.63,227246.55,397681.46,249101.1,435926.92,270169.96999999997,472797.45]
[8,2022,"Region VIII -","SOUTH DAKOTA","SD","PIERRE",2,"Row House",83317.52,145805.65,108912.85,190597.5,131699.31,230473.8,160701.49,281227.61,190424.3,333242.53000000003,209709.18,366991.06,227691.87,398460.77]
[8,2022,"Region VIII -","SOUTH DAKOTA","SD","PIERRE",3,"Walkup",80330.14,140577.75,109716.68,192004.18,139063.16,243360.52,183428.83,321000.45,227421.62,397987.83,256335.83,448587.7,284918.59000000003,498607.53]
[8,2022,"Region VIII -","SOUTH DAKOTA","SD","PIERRE",4,"Elevator",84991.05,135985.69,118987.48,190379.97,152983.9,244774.24,203978.53,326365.65999999997,254973.16,407957.07,288969.59000000003,462351.34,322966.01,516745.62]
[8,2022,"Region VIII -","SOUTH DAKOTA","SD","RAPID CITY",1,"Detached/Semi-Detached",103474.76,181080.83,134226.93,234897.13,160405.79999999999,280710.15000000002,191185.11,334573.94,225014.93,393776.12,246723.7,431766.48,267716.73,468504.29]
[8,2022,"Region VIII -","SOUTH DAKOTA","SD","RAPID CITY",2,"Row House",81230.649999999994,142153.64000000001,106394.94,186191.15,128877.23,225535.15,157655,275896.25,187004.87,327258.52,206061.07,360606.88,223868.37,391769.64]
[8,2022,"Region VIII -","SOUTH DAKOTA","SD","RAPID CITY",3,"Walkup",77578.87,135763.01999999999,105776.33,185108.57,133932.44,234381.77,176523.72,308916.51,218730.09,382777.66,246439.99,431269.98,273807.75,479163.56]
[8,2022,"Region VIII -","SOUTH DAKOTA","SD","RAPID CITY",4,"Elevator",83348.61,133357.76999999999,116688.05,186700.88,150027.49,240043.99,200036.66,320058.65000000002,250045.82,400073.32,283385.26,453416.43,316724.71000000002,506759.54]
[8,2022,"Region VIII -","SOUTH DAKOTA","SD","SIOUX FALLS",1,"Detached/Semi-Detached",107918.56,188857.48,139950.28,244912.98,167210.65,292618.63,199245.83,348680.2,234470.39,410323.18,257073.21,449878.11,278913.77,488099.09]
[8,2022,"Region VIII -","SOUTH DAKOTA","SD","SIOUX FALLS",2,"Row House",84979.32,148713.81,111248.54,194684.94,134696.81,235719.41,164667.9,288168.82,195272.51,341726.9,215139.87,376494.78,233695.14,408966.49]
[8,2022,"Region VIII -","SOUTH DAKOTA","SD","SIOUX FALLS",3,"Walkup",81357.399999999994,142375.46,110977.71,194210.99,140555.38,245971.91,185290.15,324257.77,229627.99,401848.98,258745.5,452804.63,287510.18,503142.81]
[8,2022,"Region VIII -","SOUTH DAKOTA","SD","SIOUX FALLS",4,"Elevator",87064.5,139303.20000000001,121890.3,195024.48,156716.1,250745.76,208954.8,334327.67999999999,261193.5,417909.6,296019.3,473630.88,330845.09000000003,529352.16]
[8,2022,"Region VIII -","SOUTH DAKOTA","SD","WATERTOWN",1,"Detached/Semi-Detached",100225.15,175394.02,130085.37,227649.39,155518.82999999999,272157.95,185449.9,324537.33,218321.57,382062.75,239417.23,418980.16,259847.95,454733.91]
[8,2022,"Region VIII -","SOUTH DAKOTA","SD","WATERTOWN",2,"Row House",78212.75,136872.31,102543.29,179450.76,124318.68,217557.7,152269.06,266470.86,180707.45,316238.03999999998,199178.18,348561.81,216456.34,378798.59]
[8,2022,"Region VIII -","SOUTH DAKOTA","SD","WATERTOWN",3,"Walkup",74340.63,130096.1,101272.31,177226.54,128163.08,224285.39,168852.63,295492.09999999998,209161.27,366032.22,235610.48,412318.33,261721.1,458011.92]
[8,2022,"Region VIII -","SOUTH DAKOTA","SD","WATERTOWN",4,"Elevator",80486.240000000005,128777.98,112680.73,180289.18,144875.23000000001,231800.37,193166.97,309067.15999999997,241458.71,386333.95,273653.21000000002,437845.14,305847.71000000002,489356.34]
[8,2022,"Region VIII -","UTAH","UT","OGDEN",1,"Detached/Semi-Detached",103837.38,181715.41,134804.88,235908.55,161187.32999999999,282077.83,192247.03,336432.29,226347.35,396107.87,248232.25,434406.43,269440.15999999997,471520.28]
[8,2022,"Region VIII -","UTAH","UT","OGDEN",2,"Row House",80834.94,141461.15,106024.07,185542.13,128583.92,225021.86,157573.84,275754.21999999997,187041.49,327322.61,206183.39,360820.93,224096.96,392169.68]
[8,2022,"Region VIII -","UTAH","UT","OGDEN",3,"Walkup",76682.13,134193.73000000001,104424.27,182742.47,132123.66,231216.41,174042.03,304573.56,215562.37,377234.15,242800.34,424900.59,269684.5,471947.87]
[8,2022,"Region VIII -","UTAH","UT","OGDEN",4,"Elevator",83283.92,133254.26999999999,116597.48,186555.97,149911.04999999999,239857.68,199881.4,319810.24,249851.75,399762.8,283165.31,453064.51,316478.88,506366.22]
[8,2022,"Region VIII -","UTAH","UT","PROVO",1,"Detached/Semi-Detached",102721.35,179762.36,133294.09,233264.65,159328.59,278825.03000000003,189955.13,332421.46999999997,223601.46,391302.55,245193.53,429088.68,266092.15000000002,465661.25]
[8,2022,"Region VIII -","UTAH","UT","PROVO",2,"Row House",80357.87,140626.28,105312.75,184297.31,127630.83,223353.95,156245.09,273428.90000000002,185387.43,324428,204312.71,357547.23,222008.48,388514.84]
[8,2022,"Region VIII -","UTAH","UT","PROVO",3,"Walkup",76530.8,133928.9,104293.82,182514.18,132015.26999999999,231026.73,173956.49,304423.84999999998,215510.72,377143.76,242783.57,424871.24,269712.43,471996.76]
[8,2022,"Region VIII -","UTAH","UT","PROVO",4,"Elevator",82594.210000000006,132150.74,115631.9,185011.04,148669.57999999999,237871.33,198226.11,317161.77,247782.63,396452.22,280820.32,449312.51,313858,502172.81]
[8,2022,"Region VIII -","UTAH","UT","SALT LAKE CITY",1,"Detached/Semi-Detached",102721.35,179762.36,133294.09,233264.65,159328.59,278825.03000000003,189955.13,332421.46999999997,223601.46,391302.55,245193.53,429088.68,266092.15000000002,465661.25]
[8,2022,"Region VIII -","UTAH","UT","SALT LAKE CITY",2,"Row House",80357.87,140626.28,105312.75,184297.31,127630.83,223353.95,156245.09,273428.90000000002,185387.43,324428,204312.71,357547.23,222008.48,388514.84]
[8,2022,"Region VIII -","UTAH","UT","SALT LAKE CITY",3,"Walkup",76530.8,133928.9,104293.82,182514.18,132015.26999999999,231026.73,173956.49,304423.84999999998,215510.72,377143.76,242783.57,424871.24,269712.43,471996.76]
[8,2022,"Region VIII -","UTAH","UT","SALT LAKE CITY",4,"Elevator",82594.210000000006,132150.74,115631.9,185011.04,148669.57999999999,237871.33,198226.11,317161.77,247782.63,396452.22,280820.32,449312.51,313858,502172.81]
[8,2022,"Region VIII -","WYOMING","WY","CASPER",1,"Detached/Semi-Detached",96647.39,169132.93,125183.67,219071.43,149440.97,261521.69,177889.77,311307.11,209223.53,366141.19,229326.17,401320.8,248688.62,435205.08]
[8,2022,"Region VIII -","WYOMING","WY","CASPER",2,"Row House",77052.72,134842.26,100666.69,176166.7,121667.69,212918.46,148353.35999999999,259618.38,175740.77,307546.34000000003,193506.78,338636.86,210062.93,367610.12]
[8,2022,"Region VIII -","WYOMING","WY","CASPER",3,"Walkup",74489.929999999993,130357.37,101789.37,178131.39,129052.39,225841.68,170261.5,297957.62,211131.54,369480.2,238001.5,416502.63,264570.07,462997.61]
[8,2022,"Region VIII -","WYOMING","WY","CASPER",4,"Elevator",78468.88,125550.21,109856.43,175770.29,141243.98000000001,225990.38,188325.31,301320.5,235406.64,376650.63,266794.19,426870.71,298181.74,477090.79]
[8,2022,"Region VIII -","WYOMING","WY","CHEYENNE",1,"Detached/Semi-Detached",99373.26,173903.21,128761.71,225332.99,153752.35999999999,269066.64,183079.44,320389.02,215363.79,376886.63,236077.42,413135.48,256048.13,448084.22]
[8,2022,"Region VIII -","WYOMING","WY","CHEYENNE",2,"Row House",78926.66,138121.65,103178.77,180562.85,124771.56,218350.23,152258.82999999999,266452.96000000002,180425.25,315744.19,198700.66,347726.15,215743.06,377550.36]
[8,2022,"Region VIII -","WYOMING","WY","CHEYENNE",3,"Walkup",76076.81,133134.42000000001,103902.46,181829.3,131690.1,230457.68,173699.83,303974.7,215355.75,376872.56,242733.24,424783.17,269796.23,472143.41]
[8,2022,"Region VIII -","WYOMING","WY","CHEYENNE",4,"Elevator",80525.100000000006,128840.16,112735.14,180376.23,144945.18,231912.29,193260.24,309216.39,241575.3,386520.48,273785.34000000003,438056.55,305995.38,489592.61]
[8,2022,"Region VIII -","WYOMING","WY","ROCK SPRINGS",1,"Detached/Semi-Detached",104239.5,182419.12,135077.14000000001,236384.99,161302.03,282278.56,192081.38,336142.41,225960.89,395431.56,247698.21,433471.86,268660.09000000003,470155.16]
[8,2022,"Region VIII -","WYOMING","WY","ROCK SPRINGS",2,"Row House",82727.960000000006,144773.93,108161.75,189283.07,130811.81,228920.67,159655.53,279397.18,189202.63,331104.61,208374.74,364655.8,226255.81,395947.66]
[8,2022,"Region VIII -","WYOMING","WY","ROCK SPRINGS",3,"Walkup",79692.87,139462.51999999999,108829.26,190451.20000000001,137925.67000000001,241369.92,181915.63,318352.36,225533.36,394683.39,254198.26,444846.95,282532.27,494431.48]
[8,2022,"Region VIII -","WYOMING","WY","ROCK SPRINGS",4,"Elevator",84434.96,135095.94,118208.95,189134.32,151982.93,243172.7,202643.91,324230.26,253304.89,405287.83,287078.87,459326.2,320852.86,513364.58]
[8,2022,"Region VIII -","WYOMING","WY","SHERIDAN",1,"Detached/Semi-Detached",98806.080000000002,172910.64,127977.89,223961.32,152775.07,267356.38,181856.34,318248.59999999998,213887.35,374302.87,234437.28,410265.23,254229.77,444902.1]
[8,2022,"Region VIII -","WYOMING","WY","SHERIDAN",2,"Row House",78785.440000000002,137874.51999999999,102927.93,180123.88,124398.03,217696.56,151677.82999999999,265436.2,179676.7,314434.21999999997,197839.2,346218.6,214764.39,375837.69]
[8,2022,"Region VIII -","WYOMING","WY","SHERIDAN",3,"Walkup",76173.8,133304.14000000001,104092.51,182161.89,131974.01999999999,230954.53,174117.69,304705.96000000002,215914.93,377851.12,243394.82,425940.94,270566.77,473491.85]
[8,2022,"Region VIII -","WYOMING","WY","SHERIDAN",4,"Elevator",80227.67,128364.28,112318.74,179709.99,144409.81,231055.7,192546.41,308074.26,240683.01,385092.83,272774.08,436438.54,304865.15000000002,487784.25]
[9,2022,"Region IX - West","ARIZONA","AZ","FLAGSTAFF",1,"Detached/Semi-Detached",104239.5,182419.12,135077.14000000001,236384.99,161302.03,282278.56,192081.38,336142.41,225960.89,395431.56,247698.21,433471.86,268660.09000000003,470155.16]
[9,2022,"Region IX - West","ARIZONA","AZ","FLAGSTAFF",2,"Row House",82727.960000000006,144773.93,108161.75,189283.07,130811.81,228920.67,159655.53,279397.18,189202.63,331104.61,208374.74,364655.8,226255.81,395947.66]
[9,2022,"Region IX - West","ARIZONA","AZ","FLAGSTAFF",3,"Walkup",79692.87,139462.51999999999,108829.26,190451.20000000001,137925.67000000001,241369.92,181915.63,318352.36,225533.36,394683.39,254198.26,444846.95,282532.27,494431.48]
[9,2022,"Region IX - West","ARIZONA","AZ","FLAGSTAFF",4,"Elevator",84434.96,135095.94,118208.95,189134.32,151982.93,243172.7,202643.91,324230.26,253304.89,405287.83,287078.87,459326.2,320852.86,513364.58]
[9,2022,"Region IX - West","ARIZONA","AZ","KINGMAN",1,"Detached/Semi-Detached",98330.6,172078.56,127478.28,223087,152277,266484.76,181404.77,317458.34999999998,213445.87,373530.27,234005.02,409508.79,253854.99,444246.23]
[9,2022,"Region IX - West","ARIZONA","AZ","KINGMAN",2,"Row House",77671.009999999995,135924.26,101628.85,177850.49,122994.31,215240.05,150263.12,262960.45,178143.38,311750.92,196238.92,343418.11,213130.07,372977.63]
[9,2022,"Region IX - West","ARIZONA","AZ","KINGMAN",3,"Walkup",74544.27,130452.48,101729.77,178027.1,128876.87,225534.52,169929.19,297376.09000000003,210624.02,368592.04,237356.7,415374.22,263771.59999999998,461600.29]
[9,2022,"Region IX - West","ARIZONA","AZ","KINGMAN",4,"Elevator",79456.009999999995,127129.62,111238.42,177981.47,143020.82,228833.32,190694.43,305111.09999999998,238368.04,381388.87,270150.45,432240.72,301932.84999999998,483092.57]
[9,2022,"Region IX - West","ARIZONA","AZ","PHOENIX",1,"Detached/Semi-Detached",98842.76,172974.83,128091.57,224160.26,152966.76,267691.83,182164.95,318788.65999999997,214301.33,375027.33,234920.43,411110.75,254807.2,445912.59]
[9,2022,"Region IX - West","ARIZONA","AZ","PHOENIX",2,"Row House",78396.149999999994,137193.26999999999,102508.64,179390.11,123985.95,216975.42,151344.34,264852.59999999998,179362.79,313884.88,197543.67,345701.42,214502.13,375378.73]
[9,2022,"Region IX - West","ARIZONA","AZ","PHOENIX",3,"Walkup",75483.19,132095.57999999999,103071.39,180374.94,130621.59,228587.78,172275.15,301481.5,213574.89,373756.06,240714.94,421251.14,267540.47999999998,468195.85]
[9,2022,"Region IX - West","ARIZONA","AZ","PHOENIX",4,"Elevator",80037.98,128060.77,112053.17,179285.07,144068.35999999999,230509.38,192091.15,307345.84000000003,240113.94,384182.3,272129.13,435406.61,304144.32,486630.92]
[9,2022,"Region IX - West","ARIZONA","AZ","PRESCOTT",1,"Detached/Semi-Detached",103178.49,180562.35,133736.85999999999,234039.51,159730.82,279528.93,190252.39,332941.69,223835.96,391712.93,245384.22,429422.39,266178.21999999997,465811.89]
[9,2022,"Region IX - West","ARIZONA","AZ","PRESCOTT",2,"Row House",81666.95,142917.17000000001,106821.48,186937.59,129240.59,226171.04,157826.54999999999,276196.46000000002,187077.71,327385.99,206060.76,360606.33,223773.94,391604.39]
[9,2022,"Region IX - West","ARIZONA","AZ","PRESCOTT",3,"Walkup",78505.63,137384.85,107167.12,187542.46,135788.63,237630.11,179066.26,313365.95,221971.64,388450.38,250161.64,437782.87,278020.76,486536.33]
[9,2022,"Region IX - West","ARIZONA","AZ","PRESCOTT",4,"Elevator",83460.72,133537.15,116845,186952.01,150229.29,240366.87,200305.72,320489.15999999997,250382.15,400611.45,283766.44,454026.31,317150.73,507441.17]
[9,2022,"Region IX - West","ARIZONA","AZ","TUCSON",1,"Detached/Semi-Detached",98312.26,172046.45,127421.44,222987.51999999999,152181.15,266317.02,181250.46,317188.31,213238.87,373168.02,233763.44,409086.02,253566.26,443740.96]
[9,2022,"Region IX - West","ARIZONA","AZ","TUCSON",2,"Row House",77865.649999999994,136264.89000000001,101838.5,178217.37,123200.35,215600.61,150429.85,263252.24,178300.33,312025.58,196386.68,343676.69,213261.2,373207.1]
[9,2022,"Region IX - West","ARIZONA","AZ","TUCSON",3,"Walkup",74889.570000000007,131056.75,102240.33,178920.57,129553.08,226717.89,170850.46,298988.31,211794.04,370639.57,238696.63,417719.11,265284.74,464248.29]
[9,2022,"Region IX - West","ARIZONA","AZ","TUCSON",4,"Elevator",79550.86,127281.37,111371.2,178193.92000000001,143191.54,229106.47,190922.06,305475.3,238652.57,381844.12,270472.90999999997,432756.67,302293.26,483669.22]
[9,2022,"Region IX - West","CALIFORNIA","CA","BAKERSFIELD",1,"Detached/Semi-Detached",124747.09,218307.4,161622.28,282838.99,192976.07,337708.12,229763.8,402086.65,270267.21000000002,472967.62,296253.77,518444.1,321301.11,562276.93000000005]
[9,2022,"Region IX - West","CALIFORNIA","CA","BAKERSFIELD",2,"Row House",99188.83,173580.45,129643.6,226876.31,156750.06,274312.59999999998,191238.04,334666.57,226594.03,396539.56,249532.82,436682.44,270919.77,474109.6]
[9,2022,"Region IX - West","CALIFORNIA","CA","BAKERSFIELD",3,"Walkup",95689.63,167456.85999999999,130709.14,228741,165681.15,289942.01,218549.48,382461.59,270975.55,474207.21,305434.86,534511.01,339501.05,594126.84]
[9,2022,"Region IX - West","CALIFORNIA","CA","BAKERSFIELD",4,"Elevator",101143.5,161829.6,141600.9,226561.44,182058.3,291293.28000000003,242744.4,388391.04,303430.5,485488.81,343887.9,550220.65,384345.3,614952.49]
[9,2022,"Region IX - West","CALIFORNIA","CA","EUREKA",1,"Detached/Semi-Detached",133308.5,233289.87,172571.82,302000.68,205929.13,360375.97,245012.86,428772.5,288094.53999999998,504165.45,315731.90999999997,552530.85,342310.88,599044.04]
[9,2022,"Region IX - West","CALIFORNIA","CA","EUREKA",2,"Row House",106898.29,187072.02,139527.19,244172.58,168495.58,294867.27,205202.9,359105.08,242965.59,425189.79,267453.59999999998,468043.8,290250.17,507937.79]
[9,2022,"Region IX - West","CALIFORNIA","CA","EUREKA",3,"Walkup",103806.32,181661.06,141963.96,248436.93,180072.52,315126.90000000002,237659.34,415903.85,294789.17,515881.05,332367.94,581643.9,369540.49,646695.85]
[9,2022,"Region IX - West","CALIFORNIA","CA","EUREKA",4,"Elevator",108558.06,173692.89,151981.28,243170.05,195404.5,312647.21000000002,260539.34,416862.94,325674.17,521078.68,369097.39,590555.84,412520.62,660033]
[9,2022,"Region IX - West","CALIFORNIA","CA","FRESNO",1,"Detached/Semi-Detached",132320.85,231561.49,171458.9,300053.07,204741.28,358297.24,243801.09,426651.9,286797.56,501895.73,314384.21999999997,550172.38,340983.85,596721.74]
[9,2022,"Region IX - West","CALIFORNIA","CA","FRESNO",2,"Row House",105058.7,183852.73,137348.31,240359.55,166100.21,290675.36,202706.94,354737.15,240212.84,420372.47,264548.53999999998,462959.95,287243.77,502676.59]
[9,2022,"Region IX - West","CALIFORNIA","CA","FRESNO",3,"Walkup",101237.87,177166.27,138259.57999999999,241954.27,175230.63,306653.59999999998,231124.87,404468.53,286547.37,501457.9,322971.53999999998,565200.19999999995,358976.39,628208.68000000005]
[9,2022,"Region IX - West","CALIFORNIA","CA","FRESNO",4,"Elevator",107204.42,171527.08,150086.19,240137.91,192967.96,308748.74,257290.62,411664.99,321613.27,514581.24,364495.04,583192.06999999995,407376.81,651802.91]
[9,2022,"Region IX - West","CALIFORNIA","CA","LOS ANGELES",1,"Detached/Semi-Detached",125789.75,220132.07,162905.71,285085,194451.43,340290.01,231438.47,405017.33,272185.14,476324,298326.18,522070.81,323494.26,566114.94999999995]
[9,2022,"Region IX - West","CALIFORNIA","CA","LOS ANGELES",2,"Row House",100444.48,175777.83,131193.51999999999,229588.67,158527.31,277422.78999999998,193233.76,338159.08,228875.91,400532.84,251994.57,440990.49,273532.76,478682.34]
[9,2022,"Region IX - West","CALIFORNIA","CA","LOS ANGELES",3,"Walkup",97222.17,170138.8,132881.82999999999,232543.21,168494.39,294865.18,222320.12,389060.21,275707.27,482487.73,310811.40999999997,543919.96,345525.7,604669.97]
[9,2022,"Region IX - West","CALIFORNIA","CA","LOS ANGELES",4,"Elevator",102212.59,163540.14000000001,143097.62,228956.2,183982.66,294372.26,245310.21,392496.34,306637.76,490620.43,347522.8,556036.49,388407.83,621452.55000000005]
[9,2022,"Region IX - West","CALIFORNIA","CA","MARYSVILLE",1,"Detached/Semi-Detached",125716.38,220003.67,162678.34,284687.09999999998,194068.05,339619.09,230821.24,403937.17,271357.17,474875.05,297359.86,520379.75,322339.38,564093.92000000004]
[9,2022,"Region IX - West","CALIFORNIA","CA","MARYSVILLE",2,"Row House",101223.05,177140.34,132032.10999999999,231056.2,159351.46,278865.06,193900.72,339326.26,229503.71,401631.5,252585.62,442024.83,274057.27,479600.23]
[9,2022,"Region IX - West","CALIFORNIA","CA","MARYSVILLE",3,"Walkup",98603.38,172555.91,134924.06,236117.11,171199.23,299598.65000000002,226005.2,395509.1,280387.34000000003,490677.84,316171.17,553299.55000000005,351578.26,615261.96]
[9,2022,"Region IX - West","CALIFORNIA","CA","MARYSVILLE",4,"Elevator",102591.97,164147.15,143628.76,229806.01,184665.54,295464.87,246220.73,393953.17,307775.90999999997,492441.46,348812.69,558100.31999999995,389849.48,623759.18000000005]
[9,2022,"Region IX - West","CALIFORNIA","CA","MODESTO",1,"Detached/Semi-Detached",127948.44,223909.78,165699.93,289974.88,197785.54,346124.7,235405.04,411958.82,276848.96000000002,484485.68,303437.28000000003,531015.24,329035.40999999997,575811.96]
[9,2022,"Region IX - West","CALIFORNIA","CA","MODESTO",2,"Row House",102177.2,178810.09,133454.76999999999,233545.85,161257.65,282200.88,196558.23,343976.9,232811.84,407420.72,256326.99,448572.23,278234.23,486909.9]
[9,2022,"Region IX - West","CALIFORNIA","CA","MODESTO",3,"Walkup",98906.04,173085.57,135184.98000000001,236573.71,171416.01,299978.02,226176.31,395808.54,280490.65999999997,490858.65,316204.73,553358.27,351522.4,615164.21]
[9,2022,"Region IX - West","CALIFORNIA","CA","MODESTO",4,"Elevator",103971.38,166354.21,145559.93,232895.89,187148.48,299437.58,249531.31,399250.1,311914.14,499062.63,353502.69,565604.31000000006,395091.24,632146]
[9,2022,"Region IX - West","CALIFORNIA","CA","PALM SPRINGS",1,"Detached/Semi-Detached",123686.08,216450.65,160282.01,280493.52,191404.86,334958.5,227934.82,398885.94,268142.28999999998,469249.01,293939.78999999998,514394.64,318819.24,557933.67000000004]
[9,2022,"Region IX - West","CALIFORNIA","CA","PALM SPRINGS",2,"Row House",98127.82,171723.69,128303.33,224530.83,155178.85,271562.99,189409.06,331465.84999999998,224469.11,392820.95,247218.84,432632.98,268437.90999999997,469766.34]
[9,2022,"Region IX - West","CALIFORNIA","CA","PALM SPRINGS",3,"Walkup",94502.399999999994,165379.19,129047.01,225832.27,163544.12,286202.21999999997,215700.11,377475.19,267413.84000000003,467974.22,301398.26,527446.94999999995,334989.56,586231.72]
[9,2022,"Region IX - West","CALIFORNIA","CA","PALM SPRINGS",4,"Elevator",100169.26,160270.81,140236.96,224379.14,180304.66,288487.46999999997,240406.22,384649.95,300507.77,480812.44,340575.48,544920.77,380643.18,609029.1]
[9,2022,"Region IX - West","CALIFORNIA","CA","REDDING",1,"Detached/Semi-Detached",131223.16,229640.53,170004.95,297508.65999999997,202978.38,355212.17,241663.5,422911.12,284258.65999999997,497452.66,311587.09000000003,545277.41,337924.56,591367.99]
[9,2022,"Region IX - West","CALIFORNIA","CA","REDDING",2,"Row House",104386.99,182677.23,136427.34,238747.84,164941.07999999999,288646.88,201211.45,352120.04,238401.83,417203.20000000001,262530.09999999998,459427.67,285024.17,498792.29]
[9,2022,"Region IX - West","CALIFORNIA","CA","REDDING",3,"Walkup",100741.24,176297.17,137618.57,240832.5,174446.03,305280.55,230118.05,402706.59,285325.7,499319.97,321614.82,562825.93999999994,357491.18,625609.56000000006]
[9,2022,"Region IX - West","CALIFORNIA","CA","REDDING",4,"Elevator",106419.87,170271.8,148987.82,238380.52,191555.77,306489.24,255407.7,408652.32,319259.62,510815.4,361827.57,578924.12,404395.52000000002,647032.84]
[9,2022,"Region IX - West","CALIFORNIA","CA","RIVERSIDE",1,"Detached/Semi-Detached",123631.05,216354.35,160111.48000000001,280195.09000000003,191117.32,334455.31,227471.89,398075.81,267521.31,468162.29,293215.05,513126.34,317953.08,556417.9]
[9,2022,"Region IX - West","CALIFORNIA","CA","RIVERSIDE",2,"Row House",98711.75,172745.56,128932.27,225631.48,155796.96,272644.68,189909.28,332341.24,224939.96,393644.94,247662.13,433408.73,268831.28999999998,470454.75]
[9,2022,"Region IX - West","CALIFORNIA","CA","RIVERSIDE",3,"Walkup",95538.3,167192.03,130578.68,228512.7,165572.75,289752.32000000001,218463.92,382311.86,270923.88,474116.8,305418.08,534481.64,339528.98,594175.71]
[9,2022,"Region IX - West","CALIFORNIA","CA","RIVERSIDE",4,"Elevator",100453.79,160726.07,140635.31,225016.5,180816.83,289306.93,241089.1,385742.57,301361.38,482178.21,341542.89,546468.64,381724.41,610759.06000000006]
[9,2022,"Region IX - West","CALIFORNIA","CA","SACRAMENTO",1,"Detached/Semi-Detached",129046.13,225830.73,167153.89000000001,292519.3,199548.44,349209.76,237542.63,415699.6,279387.86,488928.75,306234.40999999997,535910.22,332094.7,581165.72]
[9,2022,"Region IX - West","CALIFORNIA","CA","SACRAMENTO",2,"Row House",102848.91,179985.6,134375.74,235157.55,162416.78,284229.36,198053.72,346594.01,234622.85,410589.99,258345.44,452104.52,280453.83,490794.2]
[9,2022,"Region IX - West","CALIFORNIA","CA","SACRAMENTO",3,"Walkup",99402.67,173954.68,135825.99,237695.48,172200.61,301351.07,227183.13,397570.48,281712.33,492996.58,317561.45,555732.53,353007.61,617763.31999999995]
[9,2022,"Region IX - West","CALIFORNIA","CA","SACRAMENTO",4,"Elevator",104755.93,167609.49,146658.29999999999,234653.28,188560.67,301697.08,251414.23,402262.77,314267.78999999998,502828.47,356170.16,569872.26,398072.53,636916.06000000006]
[9,2022,"Region IX - West","CALIFORNIA","CA","SALINAS",1,"Detached/Semi-Detached",127856.74,223749.29,165415.73000000001,289477.53000000003,197306.32,345286.07,234633.51,410608.65,275814.02,482674.53,302229.40000000002,528901.46,327591.84000000003,573285.72]
[9,2022,"Region IX - West","CALIFORNIA","CA","SALINAS",2,"Row House",103150.42,180513.24,134503.01999999999,235380.28,162287.85,284003.74,197391.95,345435.9,233596.61,408794.07,257065.82,449865.19,278889.88,488057.3]
[9,2022,"Region IX - West","CALIFORNIA","CA","SALINAS",3,"Walkup",100632.55,176106.97,137737.78,241041.11,174797.08,305894.89,230782.68,403869.69,286340.76,501096.33,322904.46000000002,565082.80000000005,359088.14,628404.25]
[9,2022,"Region IX - West","CALIFORNIA","CA","SALINAS",4,"Elevator",104445.61,167112.98000000001,146223.85999999999,233958.18,188002.1,300803.37,250669.47,401071.16,313336.84000000003,501338.95,355115.08,568184.14,396893.33,635029.32999999996]
[9,2022,"Region IX - West","CALIFORNIA","CA","SAN BERNADINO",1,"Detached/Semi-Detached",122533.37,214433.39,158657.53,277650.68,189354.42,331370.23999999999,225334.31,394335.04,264982.40999999997,463719.22,290417.91999999998,508231.37,314893.78999999998,551064.14]
[9,2022,"Region IX - West","CALIFORNIA","CA","SAN BERNADINO",2,"Row House",98040.04,171570.06,128011.3,224019.78,154637.82999999999,270616.21000000002,188413.79,329724.13,223128.95,390475.67,245643.68,429876.45,266611.68,466570.45]
[9,2022,"Region IX - West","CALIFORNIA","CA","SAN BERNADINO",3,"Walkup",95041.67,166322.92000000001,129937.67,227390.93,164788.15,288379.27,217457.1,380549.92,269702.21000000002,471978.87,304061.36,532107.38,338043.77,591576.6]
[9,2022,"Region IX - West","CALIFORNIA","CA","SAN BERNADINO",4,"Elevator",99669.24,159470.79,139536.94,223259.11,179404.64,287047.42,239206.18,382729.9,299007.73,478412.37,338875.42,542200.68999999994,378743.12,605989]
[9,2022,"Region IX - West","CALIFORNIA","CA","SAN DIEGO",1,"Detached/Semi-Detached",122039.55,213569.21,158101.07,276676.88,188760.5,330330.88,224728.43,393274.75,264333.93,462584.37,289744.09000000003,507052.15,314230.28999999998,549903.01]
[9,2022,"Region IX - West","CALIFORNIA","CA","SAN DIEGO",2,"Row House",97120.24,169960.43,126921.87,222113.27,153440.15,268520.26,187165.81,327540.17,221752.58,388067.02,244191.16,427334.53,265108.49,463939.86]
[9,2022,"Region IX - West","CALIFORNIA","CA","SAN DIEGO",3,"Walkup",93757.45,164075.53,128085.49,224149.6,162367.22,284142.63,214189.87,374832.27,265581.32,464767.31,299363.17,523885.55,332761.73,582333.03]
[9,2022,"Region IX - West","CALIFORNIA","CA","SAN DIEGO",4,"Elevator",98992.43,158387.89000000001,138589.4,221743.04,178186.37,285098.2,237581.83,380130.93,296977.28999999998,475163.67,336574.26,538518.81999999995,376171.23,601873.98]
[9,2022,"Region IX - West","CALIFORNIA","CA","SAN FRANCISCO",1,"Detached/Semi-Detached",145309.69,254291.96,188337.93,329591.38,224937.62,393640.83,267909.12,468840.96000000002,315194.48,551590.32999999996,345534.04,604684.56999999995,374808.23,655914.4]
[9,2022,"Region IX - West","CALIFORNIA","CA","SAN FRANCISCO",2,"Row House",115065.75,201365.06,150496.5,263368.87,182070.18,318622.81,222320.3,389060.53,263514.55,461150.47,290247.58,507933.27,315190.32,551583.06000000006]
[9,2022,"Region IX - West","CALIFORNIA","CA","SAN FRANCISCO",3,"Walkup",110650.49,193638.35,151057.34,264350.34999999998,191407.98,334963.96999999997,252419.49,441734.11,312907.65999999997,547588.41,352651.62,617140.32999999996,391930.38,685878.16]
[9,2022,"Region IX - West","CALIFORNIA","CA","SAN FRANCISCO",4,"Elevator",117567.49,188107.99,164594.49,263351.18,211621.48,338594.38,282161.98,451459.17,352702.47,564323.96,399729.47,639567.16,446756.46,714810.35]
[9,2022,"Region IX - West","CALIFORNIA","CA","SAN JOSE",1,"Detached/Semi-Detached",143114.32,250450.06,185430.03,324502.55,221411.83,387470.7,263633.94,461359.4,310116.68,542704.18999999994,339939.78,594894.62,368689.65,645206.89]
[9,2022,"Region IX - West","CALIFORNIA","CA","SAN JOSE",2,"Row House",113722.32,199014.06,148654.54999999999,260145.46,179751.92,314565.84999999998,219329.32,383826.3,259892.53,454811.92,286210.69,500868.71,310751.12,543814.46]
[9,2022,"Region IX - West","CALIFORNIA","CA","SAN JOSE",3,"Walkup",109657.22,191900.14,149775.32,262106.8,189838.78,332217.87,250405.85,438210.23,310464.31,543312.55000000005,349938.18,612391.81999999995,388959.96,680679.93]
[9,2022,"Region IX - West","CALIFORNIA","CA","SAN JOSE",4,"Elevator",115998.39,185597.43,162397.75,259836.4,208797.1,334075.37,278396.14,445433.83,347995.17,556792.29,394394.53,631031.26,440793.89,705270.23]
[9,2022,"Region IX - West","CALIFORNIA","CA","SAN LUIS OBISPO",1,"Detached/Semi-Detached",125222.56,219139.48,162121.89000000001,283713.3,193474.13,338579.73,230215.36,402876.88,270708.69,473740.21,296686.02,519200.54,321675.88,562932.79]
[9,2022,"Region IX - West","CALIFORNIA","CA","SAN LUIS OBISPO",2,"Row House",100303.26,175530.7,130942.68,229149.69,158153.78,276769.11,192652.75,337142.31,228127.34,399222.85,251133.1,439482.92,272554.08,476969.64]
[9,2022,"Region IX - West","CALIFORNIA","CA","SAN LUIS OBISPO",3,"Walkup",97319.15,170308.52,133071.88,232875.79,168778.29,295362.01,222737.97,389791.45,276266.45,483466.28,311472.98,545077.72,346296.23,606018.4]
[9,2022,"Region IX - West","CALIFORNIA","CA","SAN LUIS OBISPO",4,"Elevator",101915.16,163064.25,142681.22,228289.95,183447.28,293515.65000000002,244596.37,391354.2,305745.46999999997,489192.75,346511.53,554418.44999999995,387277.59,619644.15]
[9,2022,"Region IX - West","CALIFORNIA","CA","SAN MATEO",1,"Detached/Semi-Detached",140918.95000000001,246608.16,182522.13,319413.71999999997,217886.04,381300.56,259358.77,453877.84,305038.89,533818.05000000005,334345.53000000003,585104.67000000004,362571.07,634499.38]
[9,2022,"Region IX - West","CALIFORNIA","CA","SAN MATEO",2,"Row House",112378.89,196663.05,146812.6,256922.06,177433.66,310508.90000000002,216338.33,378592.08,256270.5,448473.38,282173.8,493804.15,306311.92,536045.85]
[9,2022,"Region IX - West","CALIFORNIA","CA","SAN MATEO",3,"Walkup",108663.96,190161.93,148493.29,259863.26,188269.58,329471.76,248392.2,434686.35,308020.96999999997,539036.68999999994,347224.75,607643.30000000005,385989.54,675481.7]
[9,2022,"Region IX - West","CALIFORNIA","CA","SAN MATEO",4,"Elevator",114429.29,183086.87,160201.01,256321.62,205972.73,329556.37,274630.3,439408.49,343287.88,549260.61,389059.6,622495.36,434831.31,695730.11]
[9,2022,"Region IX - West","CALIFORNIA","CA","SANTA BARBARA",1,"Detached/Semi-Detached",125826.43,220196.26,163019.39000000001,285283.94,194643.12,340625.46,231747.08,405557.4,272599.12,477048.46,298809.33,522916.32,324071.67999999999,567125.43999999994]
[9,2022,"Region IX - West","CALIFORNIA","CA","SANTA BARBARA",2,"Row House",100055.19,175096.58,130774.23,228854.9,158115.23000000001,276701.65000000002,192900.27,337575.48,228562,399983.5,251699.03,440473.31,273270.5,478223.38]
[9,2022,"Region IX - West","CALIFORNIA","CA","SANTA BARBARA",3,"Walkup",96531.57,168930.24,131860.71,230756.25,167141.96,292498.43,220477.57,385835.75,273367.24,478392.67,308131.52,539230.16,342499.41,599373.96]
[9,2022,"Region IX - West","CALIFORNIA","CA","SANTA BARBARA",4,"Elevator",102022.9,163236.64000000001,142832.04999999999,228531.29,183641.21,293825.94,244854.95,391767.92,306068.69,489709.91,346877.84,555004.56000000006,387687,620299.21]
[9,2022,"Region IX - West","CALIFORNIA","CA","SANTA CRUZ",1,"Detached/Semi-Detached",132229.15,231401.02,171174.71,299555.74,204262.07,357458.63,243029.57,425301.75,285762.63,500084.61,313176.36,548058.63,339540.3,594195.53]
[9,2022,"Region IX - West","CALIFORNIA","CA","SANTA CRUZ",2,"Row House",106031.93,185555.88,138396.56,242193.99,167130.41,292478.21999999997,203540.67,356196.17,240997.63,421745.85,265287.39,464252.93,287899.44,503824.01]
[9,2022,"Region IX - West","CALIFORNIA","CA","SANTA CRUZ",3,"Walkup",102964.39,180187.68,140812.39000000001,246421.68,178611.7,312570.48,235731.25,412529.69,292397.48,511695.59,329671.28000000003,576924.74,366542.13,641448.73]
[9,2022,"Region IX - West","CALIFORNIA","CA","SANTA CRUZ",4,"Elevator",107678.66,172285.86,150750.13,241200.2,193821.59,310114.55,258428.79,413486.06,323035.98,516857.58,366107.45,585771.93000000005,409178.91,654686.27]
[9,2022,"Region IX - West","CALIFORNIA","CA","SANTA ROSA",1,"Detached/Semi-Detached",132759.65,232329.39,171844.84,300728.46999999997,205047.67999999999,358833.44,243944.06,426902.11,286825.09000000003,501943.91,314333.34999999998,550083.36,340781.23,596367.16]
[9,2022,"Region IX - West","CALIFORNIA","CA","SANTA ROSA",2,"Row House",106562.44,186484.26,139066.70000000001,243366.73,167916.02,293853.03000000003,204455.16,357796.52,242060.09,423605.15,266444.38,466277.66,289140.37,505995.64]
[9,2022,"Region IX - West","CALIFORNIA","CA","SANTA ROSA",3,"Walkup",103558.01,181226.51,141643.46,247876.05,179680.22,314440.38,237155.93,415022.88,294178.33,514812.08,331689.58,580456.77,368797.88,645396.30000000005]
[9,2022,"Region IX - West","CALIFORNIA","CA","SANTA ROSA",4,"Elevator",108165.78,173065.25,151432.1,242291.36,194698.41,311517.46000000002,259597.88,415356.61,324497.34999999998,519195.76,367763.66,588421.86,411029.97,657647.97]
[9,2022,"Region IX - West","CALIFORNIA","CA","STOCKTON",1,"Detached/Semi-Detached",127911.76,223845.58,165586.25,289775.94,197593.85,345789.24,235096.43,411418.75,276434.98,483761.22,302954.13,530169.73,328457.98,574801.47]
[9,2022,"Region IX - West","CALIFORNIA","CA","STOCKTON",2,"Row House",102566.49,179491.35,133874.07,234279.62,161669.73000000001,282922.02,196891.71,344560.5,233125.75,407970.06,256622.52,449089.42,278496.49,487368.86]
[9,2022,"Region IX - West","CALIFORNIA","CA","STOCKTON",3,"Walkup",99596.64,174294.13,136206.09,238360.66,172768.44,302344.76,228018.85,399032.99,282830.69,494953.71,318884.61,558048.06999999995,354548.69,620460.21]
[9,2022,"Region IX - West","CALIFORNIA","CA","STOCKTON",4,"Elevator",104161.07,166657.72,145825.5,233320.81,187489.93,299983.89,249986.57,399978.52,312483.21999999997,499973.15,354147.65,566636.24,395812.07,633299.32999999996]
[9,2022,"Region IX - West","CALIFORNIA","CA","SUSANVILLE",1,"Detached/Semi-Detached",126283.57,220996.24,163462.16,286058.78000000003,195045.34,341329.35,232044.34,406077.59,272833.61,477458.82,299000,523250,324157.74,567276.05000000005]
[9,2022,"Region IX - West","CALIFORNIA","CA","SUSANVILLE",2,"Row House",101364.26,177387.46,132282.95000000001,231495.17,159724.99,279518.71999999997,194481.72,340343.02,230252.27,402941.46,253447.08,443532.38,275035.94,481312.9]
[9,2022,"Region IX - West","CALIFORNIA","CA","SUSANVILLE",3,"Walkup",98506.39,172386.18,134734.01,235784.52,170915.32,299101.81,225587.34,394777.84,279828.15999999997,489699.27,315509.59000000003,552141.78,350807.72,613913.52]
[9,2022,"Region IX - West","CALIFORNIA","CA","SUSANVILLE",4,"Elevator",102889.4,164623.04000000001,144045.16,230472.25,185200.92,296321.46999999997,246934.55,395095.29,308668.19,493869.11,349823.95,559718.32999999996,390979.71,625567.54]
[9,2022,"Region IX - West","HAWAII","HI","HILO",1,"Detached/Semi-Detached",154347.97,270108.94,200765.32,351339.3,240382.61,420669.57,287170.12,502547.71,338403.53,592206.18000000005,371293.15,649763.01,403324.58,705818.01]
[9,2022,"Region IX - West","HAWAII","HI","HILO",2,"Row House",117714.46,206000.31,154929.21,271126.13,188458.67,329802.65999999997,231949.86,405912.25,275805.31,482659.29,304326.45,532571.30000000005,331111.33,579444.82999999996]
[9,2022,"Region IX - West","HAWAII","HI","HILO",3,"Walkup",109789.31,192131.3,149037.60999999999,260815.82,188217.83,329381.2,247576.27,433258.47,306300.81,536026.41,344746.16,603305.78,382628.04,669599.06000000006]
[9,2022,"Region IX - West","HAWAII","HI","HILO",4,"Elevator",122516.05,196025.67,171522.46,274435.94,220528.88,352846.21,294038.51,470461.62,367548.14,588077.02,416554.55,666487.29,465560.97,744897.56]
[9,2022,"Region IX - West","NEVADA","NV","CARSON CITY",1,"Detached/Semi-Detached",107532.56,188181.98,139439,244018.25,166590.73000000001,291533.78000000003,198494.16,347364.77,233577.60000000001,408760.8,256089.61,448156.82,277837.98,486216.47]
[9,2022,"Region IX - West","NEVADA","NV","CARSON CITY",2,"Row House",84743.11,148300.45000000001,110924.68,194118.19,134289.20000000001,235006.11,164142.01999999999,287248.53000000003,194635.68,340612.44,214430.09,375252.67,232914.62,407600.59]
[9,2022,"Region IX - West","NEVADA","NV","CARSON CITY",3,"Walkup",81182.77,142069.84,110752.3,193816.52,140279.48000000001,245489.08,184936.11,323638.19,229198.39,401097.19,258268.42,451969.73,286987.90999999997,502228.84]
[9,2022,"Region IX - West","NEVADA","NV","CARSON CITY",4,"Elevator",86788.62,138861.79,121504.06,194406.5,156219.51,249951.22,208292.68,333268.28999999998,260365.85,416585.36,295081.28999999998,472130.07,329796.74,527674.79]
[9,2022,"Region IX - West","NEVADA","NV","ELKO",1,"Detached/Semi-Detached",113990.3,199483.02,147764.82999999999,258588.46,176497.21,308870.11,210239.55,367919.22,247362.07,432883.62,271181.36,474567.38,294172.73,514802.29]
[9,2022,"Region IX - West","NEVADA","NV","ELKO",2,"Row House",90135.92,157737.85999999999,117918.07,206356.62,142686.26999999999,249700.97,174282.18,304993.81,206600.44,361550.77,227575.14,398256.5,247150.16,432512.78]
[9,2022,"Region IX - West","NEVADA","NV","ELKO",3,"Walkup",86579.68,151514.43,118172.29,206801.51,149720.57,262011,197425.96,345495.43,244718.57,428257.5,275788.34000000003,482629.59,306491.19,536359.57999999996]
[9,2022,"Region IX - West","NEVADA","NV","ELKO",4,"Elevator",92159.84,147455.74,129023.77,206438.04,165887.71,265420.34000000003,221183.61,353893.79,276479.52,442367.23,313343.45,501349.53,350207.39,560331.82999999996]
[9,2022,"Region IX - West","NEVADA","NV","LAS VEGAS",1,"Detached/Semi-Detached",117758.84,206077.97,152626.29999999999,267096.03000000003,182283.97,318996.95,217103.89,379931.81,255420.26,446985.45,280005.01,490008.77,303725.40000000002,531519.43999999994]
[9,2022,"Region IX - West","NEVADA","NV","LAS VEGAS",2,"Row House",93265.51,163214.64000000001,121980.07,213465.13,147567.38,258242.91,180183.37,315320.90000000002,213566.8,373741.89,235230.77,411653.84,255443.29,447025.75]
[9,2022,"Region IX - West","NEVADA","NV","LAS VEGAS",3,"Walkup",89699.1,156973.42000000001,122458.07,214301.63,155171.53,271550.17,204634.93,358111.13,253674.5,443930.37,285896.62,500319.08,317742,556048.5]
[9,2022,"Region IX - West","NEVADA","NV","LAS VEGAS",4,"Elevator",95285.15,152456.24,133399.21,213438.73,171513.27,274421.23,228684.35,365894.97,285855.44,457368.71,323969.5,518351.21,362083.56,579333.69999999995]
[9,2022,"Region IX - West","NEVADA","NV","RENO",1,"Detached/Semi-Detached",108099.75,189174.56,140222.82,245389.93,167568.01999999999,293244.03999999998,199717.25,349505.19,235054.03,411344.56,257729.75,451027.06,279656.34000000003,489398.59]
[9,2022,"Region IX - West","NEVADA","NV","RENO",2,"Row House",84884.33,148547.57,111175.52,194557.16,134662.73000000001,235659.78,164723.01999999999,288265.28999999998,195384.23,341922.41,215291.55,376760.22,233893.29,409313.27]
[9,2022,"Region IX - West","NEVADA","NV","RENO",3,"Walkup",81085.78,141900.10999999999,110562.25,193483.93,139995.56,244992.24,184518.25,322906.93,228639.21,400118.62,257606.83,450811.96,286217.37,500880.4]
[9,2022,"Region IX - West","NEVADA","NV","RENO",4,"Elevator",87086.04,139337.67000000001,121920.46,195072.74,156754.88,250807.81,209006.5,334410.40999999997,261258.13,418013.02,296092.55,473748.08,330926.96999999997,529483.15]